{"text_format":"1","workbook":"xlsx","n_sheets":6,"sheets":["Guide","05 CPD","06 DAP","07 PDR","Template Info","Holidays"],"not_rendered":{"charts":44,"images":9,"macros":1,"external_links":2,"defined_names":10,"comments":0,"pivot_tables":0},"unopened":[],"bounds":{"document_bytes":16777216,"sheet_cells":100000,"rows_first":2000,"rows_last":500,"rows_between":2000,"halvings":0,"cell_chars":16384,"cell_head_chars":4096},"cells_cut":0,"cells_raw":0,"read":"whole","date_system":"1900"}

{"sheet":"Guide","index":0,"n_rows":176,"n_cols":2,"rows_kept":176,"cut":false,"hidden":false,"merged":[]}
["HOW TO USE THIS SPREADSHEET:"]
[]
["01","Simply fill in the CPD, DAP and PDR yellow worksheet input areas"]
["02","For the bar charts and pie charts to appear in 05 CPD Worksheet - simply fill in ALL Yellow worksheet input areas throughout the worksheet"]
["03","An example can be seen below (screenshot of it in action)"]
["04","Any queries or bugs, please contact TCEE"]
["05","PS:  Ensure Macros are enabled"]
[]
["CPD Example:"]
[]
[]
[]
[]
[]
[]
[]
[]
[]
[]
[]
[]
[]
[]
[]
[]
[]
[]
[]
[]
[]
[]
[]
[]
[]
[]
[]
[]
[]
[]
[]
[]
["Ensure that the Annual Period is specified"]
["Use the buttons at the top to navigate between CPD, DAP and PDR"]
["Bar Charts & Pie Charts automatically update upon updating the DAP and PDR sections"]
[]
[]
[]
[]
[]
[]
[]
[]
[]
[]
[]
[]
[]
[]
[]
[]
[]
[]
[]
[]
[]
[]
[]
[]
[]
[]
[]
[]
[]
[]
[]
[]
[]
[]
[]
[]
[]
[]
[]
[]
[]
[]
[]
[]
[]
[]
[]
[]
[]
[]
[]
[]
[]
[]
[]
[]
[]
[]
[]
[]
["DAP Example:"]
[]
[]
[]
[]
[]
[]
[]
[]
[]
[]
[]
[]
[]
[]
[]
[]
[]
[]
[]
[]
[]
[]
[]
[]
[]
[]
[]
[]
[]
[]
["Simply provide input into the yellow boxes - using manual input and the user generated dropdown lists (which are derived from the actual CPD Worksheet)"]
[]
[]
[]
["PDR Example:"]
[]
[]
[]
[]
[]
[]
[]
[]
[]
[]
[]
[]
[]
[]
[]
[]
[]
[]
[]
[]
[]
[]
[]
[]
[]
[]
[]
[]
[]
[]
[]
["Simply provide input into the yellow boxes - using manual input and the user generated dropdown lists (which are derived from the actual CPD Worksheet)"]
["Make sure you make use of the Annual Period, Effective Learning Times, DAP Reference Numbers, Categories and Sub-Categories - these are critical (basically all the yellow input boxes) to ensure that the "]
["charts and tables auto-generate your CPD"]
[]
["Any queries - please contact TCEE"]

{"sheet":"05 CPD","index":1,"n_rows":45,"n_cols":32,"rows_kept":45,"cut":false,"hidden":false,"merged":[[0,7,0,17],[0,19,0,31],[0,0,0,4],[44,0,44,2]]}
["CONTINUING PROFESSIONAL DEVELOPMENT",null,null,null,null,"LAST UPDATED:",null,"BREAKDOWN BY MAIN CATEGORY/TYPE",null,null,null,null,null,null,null,null,null,null,null,"BREAKDOWN BY SUB-CATEGORY"]
["Annual Period","CPD\nHours","CPD\nDays","CPD \nCumulative Hours","Comments","Attributes Progress in Period","SCE/DE for \nAnnual Period","STEM Activities or Other Volunteering","ICE Involvement","Knowledge & Learning","On the Job Learning","Technical Development","Soft Skills Development","Mentoring","Other","-","-","-",null,"Health & Safety","Commercial, Contracts & Law","Management & Leadership","Techncial","Financial","IT, BIM & Emerging Technologies","History","Professionalism, Ethics, Equality & Diversity","Security","Sustainability","Quality","Other","-"]
["Sept 2007 - Aug 2008",{"$f":"IF(SUM(H3:R3)=0,\"\",SUM(H3:R3))","v":""},{"$f":"IF(B3=\"\",\"\",(B3/8))","v":""},{"$f":"IF(B3=0,\"\",B3)","v":""},null,null,null,{"$f":"IF(SUMIFS('07 PDR'!$F$4:$F$5600,'07 PDR'!$A$4:$A$5600,'05 CPD'!$A3,'07 PDR'!$K$4:$K$5600,'05 CPD'!H$2)=0,\"\",SUMIFS('07 PDR'!$F$4:$F$5600,'07 PDR'!$A$4:$A$5600,'05 CPD'!$A3,'07 PDR'!$K$4:$K$5600,'05 CPD'!H$2))","v":""},{"$f":"IF(SUMIFS('07 PDR'!$F$4:$F$5600,'07 PDR'!$A$4:$A$5600,'05 CPD'!$A3,'07 PDR'!$K$4:$K$5600,'05 CPD'!I$2)=0,\"\",SUMIFS('07 PDR'!$F$4:$F$5600,'07 PDR'!$A$4:$A$5600,'05 CPD'!$A3,'07 PDR'!$K$4:$K$5600,'05 CPD'!I$2))","v":""},{"$f":"IF(SUMIFS('07 PDR'!$F$4:$F$5600,'07 PDR'!$A$4:$A$5600,'05 CPD'!$A3,'07 PDR'!$K$4:$K$5600,'05 CPD'!J$2)=0,\"\",SUMIFS('07 PDR'!$F$4:$F$5600,'07 PDR'!$A$4:$A$5600,'05 CPD'!$A3,'07 PDR'!$K$4:$K$5600,'05 CPD'!J$2))","v":""},{"$f":"IF(SUMIFS('07 PDR'!$F$4:$F$5600,'07 PDR'!$A$4:$A$5600,'05 CPD'!$A3,'07 PDR'!$K$4:$K$5600,'05 CPD'!K$2)=0,\"\",SUMIFS('07 PDR'!$F$4:$F$5600,'07 PDR'!$A$4:$A$5600,'05 CPD'!$A3,'07 PDR'!$K$4:$K$5600,'05 CPD'!K$2))","v":""},{"$f":"IF(SUMIFS('07 PDR'!$F$4:$F$5600,'07 PDR'!$A$4:$A$5600,'05 CPD'!$A3,'07 PDR'!$K$4:$K$5600,'05 CPD'!L$2)=0,\"\",SUMIFS('07 PDR'!$F$4:$F$5600,'07 PDR'!$A$4:$A$5600,'05 CPD'!$A3,'07 PDR'!$K$4:$K$5600,'05 CPD'!L$2))","v":""},{"$f":"IF(SUMIFS('07 PDR'!$F$4:$F$5600,'07 PDR'!$A$4:$A$5600,'05 CPD'!$A3,'07 PDR'!$K$4:$K$5600,'05 CPD'!M$2)=0,\"\",SUMIFS('07 PDR'!$F$4:$F$5600,'07 PDR'!$A$4:$A$5600,'05 CPD'!$A3,'07 PDR'!$K$4:$K$5600,'05 CPD'!M$2))","v":""},{"$f":"IF(SUMIFS('07 PDR'!$F$4:$F$5600,'07 PDR'!$A$4:$A$5600,'05 CPD'!$A3,'07 PDR'!$K$4:$K$5600,'05 CPD'!N$2)=0,\"\",SUMIFS('07 PDR'!$F$4:$F$5600,'07 PDR'!$A$4:$A$5600,'05 CPD'!$A3,'07 PDR'!$K$4:$K$5600,'05 CPD'!N$2))","v":""},{"$f":"IF(SUMIFS('07 PDR'!$F$4:$F$5600,'07 PDR'!$A$4:$A$5600,'05 CPD'!$A3,'07 PDR'!$K$4:$K$5600,'05 CPD'!O$2)=0,\"\",SUMIFS('07 PDR'!$F$4:$F$5600,'07 PDR'!$A$4:$A$5600,'05 CPD'!$A3,'07 PDR'!$K$4:$K$5600,'05 CPD'!O$2))","v":""},{"$f":"IF(SUMIFS('07 PDR'!$F$4:$F$5600,'07 PDR'!$A$4:$A$5600,'05 CPD'!$A3,'07 PDR'!$K$4:$K$5600,'05 CPD'!P$2)=0,\"\",SUMIFS('07 PDR'!$F$4:$F$5600,'07 PDR'!$A$4:$A$5600,'05 CPD'!$A3,'07 PDR'!$K$4:$K$5600,'05 CPD'!P$2))","v":""},{"$f":"IF(SUMIFS('07 PDR'!$F$4:$F$5600,'07 PDR'!$A$4:$A$5600,'05 CPD'!$A3,'07 PDR'!$K$4:$K$5600,'05 CPD'!Q$2)=0,\"\",SUMIFS('07 PDR'!$F$4:$F$5600,'07 PDR'!$A$4:$A$5600,'05 CPD'!$A3,'07 PDR'!$K$4:$K$5600,'05 CPD'!Q$2))","v":""},{"$f":"IF(SUMIFS('07 PDR'!$F$4:$F$5600,'07 PDR'!$A$4:$A$5600,'05 CPD'!$A3,'07 PDR'!$K$4:$K$5600,'05 CPD'!R$2)=0,\"\",SUMIFS('07 PDR'!$F$4:$F$5600,'07 PDR'!$A$4:$A$5600,'05 CPD'!$A3,'07 PDR'!$K$4:$K$5600,'05 CPD'!R$2))","v":""},null,{"$f":"IF(SUMIFS('07 PDR'!$F$4:$F$5600,'07 PDR'!$A$4:$A$5600,'05 CPD'!$A3,'07 PDR'!$L$4:$L$5600,'05 CPD'!T$2)=0,\"\",SUMIFS('07 PDR'!$F$4:$F$5600,'07 PDR'!$A$4:$A$5600,'05 CPD'!$A3,'07 PDR'!$L$4:$L$5600,'05 CPD'!T$2))","v":""},{"$f":"IF(SUMIFS('07 PDR'!$F$4:$F$5600,'07 PDR'!$A$4:$A$5600,'05 CPD'!$A3,'07 PDR'!$L$4:$L$5600,'05 CPD'!U$2)=0,\"\",SUMIFS('07 PDR'!$F$4:$F$5600,'07 PDR'!$A$4:$A$5600,'05 CPD'!$A3,'07 PDR'!$L$4:$L$5600,'05 CPD'!U$2))","v":""},{"$f":"IF(SUMIFS('07 PDR'!$F$4:$F$5600,'07 PDR'!$A$4:$A$5600,'05 CPD'!$A3,'07 PDR'!$L$4:$L$5600,'05 CPD'!V$2)=0,\"\",SUMIFS('07 PDR'!$F$4:$F$5600,'07 PDR'!$A$4:$A$5600,'05 CPD'!$A3,'07 PDR'!$L$4:$L$5600,'05 CPD'!V$2))","v":""},{"$f":"IF(SUMIFS('07 PDR'!$F$4:$F$5600,'07 PDR'!$A$4:$A$5600,'05 CPD'!$A3,'07 PDR'!$L$4:$L$5600,'05 CPD'!W$2)=0,\"\",SUMIFS('07 PDR'!$F$4:$F$5600,'07 PDR'!$A$4:$A$5600,'05 CPD'!$A3,'07 PDR'!$L$4:$L$5600,'05 CPD'!W$2))","v":""},{"$f":"IF(SUMIFS('07 PDR'!$F$4:$F$5600,'07 PDR'!$A$4:$A$5600,'05 CPD'!$A3,'07 PDR'!$L$4:$L$5600,'05 CPD'!X$2)=0,\"\",SUMIFS('07 PDR'!$F$4:$F$5600,'07 PDR'!$A$4:$A$5600,'05 CPD'!$A3,'07 PDR'!$L$4:$L$5600,'05 CPD'!X$2))","v":""},{"$f":"IF(SUMIFS('07 PDR'!$F$4:$F$5600,'07 PDR'!$A$4:$A$5600,'05 CPD'!$A3,'07 PDR'!$L$4:$L$5600,'05 CPD'!Y$2)=0,\"\",SUMIFS('07 PDR'!$F$4:$F$5600,'07 PDR'!$A$4:$A$5600,'05 CPD'!$A3,'07 PDR'!$L$4:$L$5600,'05 CPD'!Y$2))","v":""},{"$f":"IF(SUMIFS('07 PDR'!$F$4:$F$5600,'07 PDR'!$A$4:$A$5600,'05 CPD'!$A3,'07 PDR'!$L$4:$L$5600,'05 CPD'!Z$2)=0,\"\",SUMIFS('07 PDR'!$F$4:$F$5600,'07 PDR'!$A$4:$A$5600,'05 CPD'!$A3,'07 PDR'!$L$4:$L$5600,'05 CPD'!Z$2))","v":""},{"$f":"IF(SUMIFS('07 PDR'!$F$4:$F$5600,'07 PDR'!$A$4:$A$5600,'05 CPD'!$A3,'07 PDR'!$L$4:$L$5600,'05 CPD'!AA$2)=0,\"\",SUMIFS('07 PDR'!$F$4:$F$5600,'07 PDR'!$A$4:$A$5600,'05 CPD'!$A3,'07 PDR'!$L$4:$L$5600,'05 CPD'!AA$2))","v":""},{"$f":"IF(SUMIFS('07 PDR'!$F$4:$F$5600,'07 PDR'!$A$4:$A$5600,'05 CPD'!$A3,'07 PDR'!$L$4:$L$5600,'05 CPD'!AB$2)=0,\"\",SUMIFS('07 PDR'!$F$4:$F$5600,'07 PDR'!$A$4:$A$5600,'05 CPD'!$A3,'07 PDR'!$L$4:$L$5600,'05 CPD'!AB$2))","v":""},{"$f":"IF(SUMIFS('07 PDR'!$F$4:$F$5600,'07 PDR'!$A$4:$A$5600,'05 CPD'!$A3,'07 PDR'!$L$4:$L$5600,'05 CPD'!AC$2)=0,\"\",SUMIFS('07 PDR'!$F$4:$F$5600,'07 PDR'!$A$4:$A$5600,'05 CPD'!$A3,'07 PDR'!$L$4:$L$5600,'05 CPD'!AC$2))","v":""},{"$f":"IF(SUMIFS('07 PDR'!$F$4:$F$5600,'07 PDR'!$A$4:$A$5600,'05 CPD'!$A3,'07 PDR'!$L$4:$L$5600,'05 CPD'!AD$2)=0,\"\",SUMIFS('07 PDR'!$F$4:$F$5600,'07 PDR'!$A$4:$A$5600,'05 CPD'!$A3,'07 PDR'!$L$4:$L$5600,'05 CPD'!AD$2))","v":""},{"$f":"IF(SUMIFS('07 PDR'!$F$4:$F$5600,'07 PDR'!$A$4:$A$5600,'05 CPD'!$A3,'07 PDR'!$L$4:$L$5600,'05 CPD'!AE$2)=0,\"\",SUMIFS('07 PDR'!$F$4:$F$5600,'07 PDR'!$A$4:$A$5600,'05 CPD'!$A3,'07 PDR'!$L$4:$L$5600,'05 CPD'!AE$2))","v":""},{"$f":"IF(SUMIFS('07 PDR'!$F$4:$F$5600,'07 PDR'!$A$4:$A$5600,'05 CPD'!$A3,'07 PDR'!$L$4:$L$5600,'05 CPD'!AF$2)=0,\"\",SUMIFS('07 PDR'!$F$4:$F$5600,'07 PDR'!$A$4:$A$5600,'05 CPD'!$A3,'07 PDR'!$L$4:$L$5600,'05 CPD'!AF$2))","v":""}]
["Sept 2008 - Aug 2009",{"$f":"IF(SUM(H4:R4)=0,\"\",SUM(H4:R4))","v":""},{"$f":"IF(B4=\"\",\"\",(B4/8))","v":""},{"$f":"IF(B4=\"\",\"\",(B4+D3))","v":""},null,null,null,{"$f":"IF(SUMIFS('07 PDR'!$F$4:$F$5600,'07 PDR'!$A$4:$A$5600,'05 CPD'!$A4,'07 PDR'!$K$4:$K$5600,'05 CPD'!H$2)=0,\"\",SUMIFS('07 PDR'!$F$4:$F$5600,'07 PDR'!$A$4:$A$5600,'05 CPD'!$A4,'07 PDR'!$K$4:$K$5600,'05 CPD'!H$2))","v":""},{"$f":"IF(SUMIFS('07 PDR'!$F$4:$F$5600,'07 PDR'!$A$4:$A$5600,'05 CPD'!$A4,'07 PDR'!$K$4:$K$5600,'05 CPD'!I$2)=0,\"\",SUMIFS('07 PDR'!$F$4:$F$5600,'07 PDR'!$A$4:$A$5600,'05 CPD'!$A4,'07 PDR'!$K$4:$K$5600,'05 CPD'!I$2))","v":""},{"$f":"IF(SUMIFS('07 PDR'!$F$4:$F$5600,'07 PDR'!$A$4:$A$5600,'05 CPD'!$A4,'07 PDR'!$K$4:$K$5600,'05 CPD'!J$2)=0,\"\",SUMIFS('07 PDR'!$F$4:$F$5600,'07 PDR'!$A$4:$A$5600,'05 CPD'!$A4,'07 PDR'!$K$4:$K$5600,'05 CPD'!J$2))","v":""},{"$f":"IF(SUMIFS('07 PDR'!$F$4:$F$5600,'07 PDR'!$A$4:$A$5600,'05 CPD'!$A4,'07 PDR'!$K$4:$K$5600,'05 CPD'!K$2)=0,\"\",SUMIFS('07 PDR'!$F$4:$F$5600,'07 PDR'!$A$4:$A$5600,'05 CPD'!$A4,'07 PDR'!$K$4:$K$5600,'05 CPD'!K$2))","v":""},{"$f":"IF(SUMIFS('07 PDR'!$F$4:$F$5600,'07 PDR'!$A$4:$A$5600,'05 CPD'!$A4,'07 PDR'!$K$4:$K$5600,'05 CPD'!L$2)=0,\"\",SUMIFS('07 PDR'!$F$4:$F$5600,'07 PDR'!$A$4:$A$5600,'05 CPD'!$A4,'07 PDR'!$K$4:$K$5600,'05 CPD'!L$2))","v":""},{"$f":"IF(SUMIFS('07 PDR'!$F$4:$F$5600,'07 PDR'!$A$4:$A$5600,'05 CPD'!$A4,'07 PDR'!$K$4:$K$5600,'05 CPD'!M$2)=0,\"\",SUMIFS('07 PDR'!$F$4:$F$5600,'07 PDR'!$A$4:$A$5600,'05 CPD'!$A4,'07 PDR'!$K$4:$K$5600,'05 CPD'!M$2))","v":""},{"$f":"IF(SUMIFS('07 PDR'!$F$4:$F$5600,'07 PDR'!$A$4:$A$5600,'05 CPD'!$A4,'07 PDR'!$K$4:$K$5600,'05 CPD'!N$2)=0,\"\",SUMIFS('07 PDR'!$F$4:$F$5600,'07 PDR'!$A$4:$A$5600,'05 CPD'!$A4,'07 PDR'!$K$4:$K$5600,'05 CPD'!N$2))","v":""},{"$f":"IF(SUMIFS('07 PDR'!$F$4:$F$5600,'07 PDR'!$A$4:$A$5600,'05 CPD'!$A4,'07 PDR'!$K$4:$K$5600,'05 CPD'!O$2)=0,\"\",SUMIFS('07 PDR'!$F$4:$F$5600,'07 PDR'!$A$4:$A$5600,'05 CPD'!$A4,'07 PDR'!$K$4:$K$5600,'05 CPD'!O$2))","v":""},{"$f":"IF(SUMIFS('07 PDR'!$F$4:$F$5600,'07 PDR'!$A$4:$A$5600,'05 CPD'!$A4,'07 PDR'!$K$4:$K$5600,'05 CPD'!P$2)=0,\"\",SUMIFS('07 PDR'!$F$4:$F$5600,'07 PDR'!$A$4:$A$5600,'05 CPD'!$A4,'07 PDR'!$K$4:$K$5600,'05 CPD'!P$2))","v":""},{"$f":"IF(SUMIFS('07 PDR'!$F$4:$F$5600,'07 PDR'!$A$4:$A$5600,'05 CPD'!$A4,'07 PDR'!$K$4:$K$5600,'05 CPD'!Q$2)=0,\"\",SUMIFS('07 PDR'!$F$4:$F$5600,'07 PDR'!$A$4:$A$5600,'05 CPD'!$A4,'07 PDR'!$K$4:$K$5600,'05 CPD'!Q$2))","v":""},{"$f":"IF(SUMIFS('07 PDR'!$F$4:$F$5600,'07 PDR'!$A$4:$A$5600,'05 CPD'!$A4,'07 PDR'!$K$4:$K$5600,'05 CPD'!R$2)=0,\"\",SUMIFS('07 PDR'!$F$4:$F$5600,'07 PDR'!$A$4:$A$5600,'05 CPD'!$A4,'07 PDR'!$K$4:$K$5600,'05 CPD'!R$2))","v":""},null,{"$f":"IF(SUMIFS('07 PDR'!$F$4:$F$5600,'07 PDR'!$A$4:$A$5600,'05 CPD'!$A4,'07 PDR'!$L$4:$L$5600,'05 CPD'!T$2)=0,\"\",SUMIFS('07 PDR'!$F$4:$F$5600,'07 PDR'!$A$4:$A$5600,'05 CPD'!$A4,'07 PDR'!$L$4:$L$5600,'05 CPD'!T$2))","v":""},{"$f":"IF(SUMIFS('07 PDR'!$F$4:$F$5600,'07 PDR'!$A$4:$A$5600,'05 CPD'!$A4,'07 PDR'!$L$4:$L$5600,'05 CPD'!U$2)=0,\"\",SUMIFS('07 PDR'!$F$4:$F$5600,'07 PDR'!$A$4:$A$5600,'05 CPD'!$A4,'07 PDR'!$L$4:$L$5600,'05 CPD'!U$2))","v":""},{"$f":"IF(SUMIFS('07 PDR'!$F$4:$F$5600,'07 PDR'!$A$4:$A$5600,'05 CPD'!$A4,'07 PDR'!$L$4:$L$5600,'05 CPD'!V$2)=0,\"\",SUMIFS('07 PDR'!$F$4:$F$5600,'07 PDR'!$A$4:$A$5600,'05 CPD'!$A4,'07 PDR'!$L$4:$L$5600,'05 CPD'!V$2))","v":""},{"$f":"IF(SUMIFS('07 PDR'!$F$4:$F$5600,'07 PDR'!$A$4:$A$5600,'05 CPD'!$A4,'07 PDR'!$L$4:$L$5600,'05 CPD'!W$2)=0,\"\",SUMIFS('07 PDR'!$F$4:$F$5600,'07 PDR'!$A$4:$A$5600,'05 CPD'!$A4,'07 PDR'!$L$4:$L$5600,'05 CPD'!W$2))","v":""},{"$f":"IF(SUMIFS('07 PDR'!$F$4:$F$5600,'07 PDR'!$A$4:$A$5600,'05 CPD'!$A4,'07 PDR'!$L$4:$L$5600,'05 CPD'!X$2)=0,\"\",SUMIFS('07 PDR'!$F$4:$F$5600,'07 PDR'!$A$4:$A$5600,'05 CPD'!$A4,'07 PDR'!$L$4:$L$5600,'05 CPD'!X$2))","v":""},{"$f":"IF(SUMIFS('07 PDR'!$F$4:$F$5600,'07 PDR'!$A$4:$A$5600,'05 CPD'!$A4,'07 PDR'!$L$4:$L$5600,'05 CPD'!Y$2)=0,\"\",SUMIFS('07 PDR'!$F$4:$F$5600,'07 PDR'!$A$4:$A$5600,'05 CPD'!$A4,'07 PDR'!$L$4:$L$5600,'05 CPD'!Y$2))","v":""},{"$f":"IF(SUMIFS('07 PDR'!$F$4:$F$5600,'07 PDR'!$A$4:$A$5600,'05 CPD'!$A4,'07 PDR'!$L$4:$L$5600,'05 CPD'!Z$2)=0,\"\",SUMIFS('07 PDR'!$F$4:$F$5600,'07 PDR'!$A$4:$A$5600,'05 CPD'!$A4,'07 PDR'!$L$4:$L$5600,'05 CPD'!Z$2))","v":""},{"$f":"IF(SUMIFS('07 PDR'!$F$4:$F$5600,'07 PDR'!$A$4:$A$5600,'05 CPD'!$A4,'07 PDR'!$L$4:$L$5600,'05 CPD'!AA$2)=0,\"\",SUMIFS('07 PDR'!$F$4:$F$5600,'07 PDR'!$A$4:$A$5600,'05 CPD'!$A4,'07 PDR'!$L$4:$L$5600,'05 CPD'!AA$2))","v":""},{"$f":"IF(SUMIFS('07 PDR'!$F$4:$F$5600,'07 PDR'!$A$4:$A$5600,'05 CPD'!$A4,'07 PDR'!$L$4:$L$5600,'05 CPD'!AB$2)=0,\"\",SUMIFS('07 PDR'!$F$4:$F$5600,'07 PDR'!$A$4:$A$5600,'05 CPD'!$A4,'07 PDR'!$L$4:$L$5600,'05 CPD'!AB$2))","v":""},{"$f":"IF(SUMIFS('07 PDR'!$F$4:$F$5600,'07 PDR'!$A$4:$A$5600,'05 CPD'!$A4,'07 PDR'!$L$4:$L$5600,'05 CPD'!AC$2)=0,\"\",SUMIFS('07 PDR'!$F$4:$F$5600,'07 PDR'!$A$4:$A$5600,'05 CPD'!$A4,'07 PDR'!$L$4:$L$5600,'05 CPD'!AC$2))","v":""},{"$f":"IF(SUMIFS('07 PDR'!$F$4:$F$5600,'07 PDR'!$A$4:$A$5600,'05 CPD'!$A4,'07 PDR'!$L$4:$L$5600,'05 CPD'!AD$2)=0,\"\",SUMIFS('07 PDR'!$F$4:$F$5600,'07 PDR'!$A$4:$A$5600,'05 CPD'!$A4,'07 PDR'!$L$4:$L$5600,'05 CPD'!AD$2))","v":""},{"$f":"IF(SUMIFS('07 PDR'!$F$4:$F$5600,'07 PDR'!$A$4:$A$5600,'05 CPD'!$A4,'07 PDR'!$L$4:$L$5600,'05 CPD'!AE$2)=0,\"\",SUMIFS('07 PDR'!$F$4:$F$5600,'07 PDR'!$A$4:$A$5600,'05 CPD'!$A4,'07 PDR'!$L$4:$L$5600,'05 CPD'!AE$2))","v":""},{"$f":"IF(SUMIFS('07 PDR'!$F$4:$F$5600,'07 PDR'!$A$4:$A$5600,'05 CPD'!$A4,'07 PDR'!$L$4:$L$5600,'05 CPD'!AF$2)=0,\"\",SUMIFS('07 PDR'!$F$4:$F$5600,'07 PDR'!$A$4:$A$5600,'05 CPD'!$A4,'07 PDR'!$L$4:$L$5600,'05 CPD'!AF$2))","v":""}]
["Sept 2009 - Aug 2010","","",{"$f":"IF(B5=\"\",\"\",(B5+D4))","v":""},null,null,null,{"$f":"IF(SUMIFS('07 PDR'!$F$4:$F$5600,'07 PDR'!$A$4:$A$5600,'05 CPD'!$A5,'07 PDR'!$K$4:$K$5600,'05 CPD'!H$2)=0,\"\",SUMIFS('07 PDR'!$F$4:$F$5600,'07 PDR'!$A$4:$A$5600,'05 CPD'!$A5,'07 PDR'!$K$4:$K$5600,'05 CPD'!H$2))","v":""},{"$f":"IF(SUMIFS('07 PDR'!$F$4:$F$5600,'07 PDR'!$A$4:$A$5600,'05 CPD'!$A5,'07 PDR'!$K$4:$K$5600,'05 CPD'!I$2)=0,\"\",SUMIFS('07 PDR'!$F$4:$F$5600,'07 PDR'!$A$4:$A$5600,'05 CPD'!$A5,'07 PDR'!$K$4:$K$5600,'05 CPD'!I$2))","v":""},{"$f":"IF(SUMIFS('07 PDR'!$F$4:$F$5600,'07 PDR'!$A$4:$A$5600,'05 CPD'!$A5,'07 PDR'!$K$4:$K$5600,'05 CPD'!J$2)=0,\"\",SUMIFS('07 PDR'!$F$4:$F$5600,'07 PDR'!$A$4:$A$5600,'05 CPD'!$A5,'07 PDR'!$K$4:$K$5600,'05 CPD'!J$2))","v":""},{"$f":"IF(SUMIFS('07 PDR'!$F$4:$F$5600,'07 PDR'!$A$4:$A$5600,'05 CPD'!$A5,'07 PDR'!$K$4:$K$5600,'05 CPD'!K$2)=0,\"\",SUMIFS('07 PDR'!$F$4:$F$5600,'07 PDR'!$A$4:$A$5600,'05 CPD'!$A5,'07 PDR'!$K$4:$K$5600,'05 CPD'!K$2))","v":""},{"$f":"IF(SUMIFS('07 PDR'!$F$4:$F$5600,'07 PDR'!$A$4:$A$5600,'05 CPD'!$A5,'07 PDR'!$K$4:$K$5600,'05 CPD'!L$2)=0,\"\",SUMIFS('07 PDR'!$F$4:$F$5600,'07 PDR'!$A$4:$A$5600,'05 CPD'!$A5,'07 PDR'!$K$4:$K$5600,'05 CPD'!L$2))","v":""},{"$f":"IF(SUMIFS('07 PDR'!$F$4:$F$5600,'07 PDR'!$A$4:$A$5600,'05 CPD'!$A5,'07 PDR'!$K$4:$K$5600,'05 CPD'!M$2)=0,\"\",SUMIFS('07 PDR'!$F$4:$F$5600,'07 PDR'!$A$4:$A$5600,'05 CPD'!$A5,'07 PDR'!$K$4:$K$5600,'05 CPD'!M$2))","v":""},{"$f":"IF(SUMIFS('07 PDR'!$F$4:$F$5600,'07 PDR'!$A$4:$A$5600,'05 CPD'!$A5,'07 PDR'!$K$4:$K$5600,'05 CPD'!N$2)=0,\"\",SUMIFS('07 PDR'!$F$4:$F$5600,'07 PDR'!$A$4:$A$5600,'05 CPD'!$A5,'07 PDR'!$K$4:$K$5600,'05 CPD'!N$2))","v":""},{"$f":"IF(SUMIFS('07 PDR'!$F$4:$F$5600,'07 PDR'!$A$4:$A$5600,'05 CPD'!$A5,'07 PDR'!$K$4:$K$5600,'05 CPD'!O$2)=0,\"\",SUMIFS('07 PDR'!$F$4:$F$5600,'07 PDR'!$A$4:$A$5600,'05 CPD'!$A5,'07 PDR'!$K$4:$K$5600,'05 CPD'!O$2))","v":""},{"$f":"IF(SUMIFS('07 PDR'!$F$4:$F$5600,'07 PDR'!$A$4:$A$5600,'05 CPD'!$A5,'07 PDR'!$K$4:$K$5600,'05 CPD'!P$2)=0,\"\",SUMIFS('07 PDR'!$F$4:$F$5600,'07 PDR'!$A$4:$A$5600,'05 CPD'!$A5,'07 PDR'!$K$4:$K$5600,'05 CPD'!P$2))","v":""},{"$f":"IF(SUMIFS('07 PDR'!$F$4:$F$5600,'07 PDR'!$A$4:$A$5600,'05 CPD'!$A5,'07 PDR'!$K$4:$K$5600,'05 CPD'!Q$2)=0,\"\",SUMIFS('07 PDR'!$F$4:$F$5600,'07 PDR'!$A$4:$A$5600,'05 CPD'!$A5,'07 PDR'!$K$4:$K$5600,'05 CPD'!Q$2))","v":""},{"$f":"IF(SUMIFS('07 PDR'!$F$4:$F$5600,'07 PDR'!$A$4:$A$5600,'05 CPD'!$A5,'07 PDR'!$K$4:$K$5600,'05 CPD'!R$2)=0,\"\",SUMIFS('07 PDR'!$F$4:$F$5600,'07 PDR'!$A$4:$A$5600,'05 CPD'!$A5,'07 PDR'!$K$4:$K$5600,'05 CPD'!R$2))","v":""},null,{"$f":"IF(SUMIFS('07 PDR'!$F$4:$F$5600,'07 PDR'!$A$4:$A$5600,'05 CPD'!$A5,'07 PDR'!$L$4:$L$5600,'05 CPD'!T$2)=0,\"\",SUMIFS('07 PDR'!$F$4:$F$5600,'07 PDR'!$A$4:$A$5600,'05 CPD'!$A5,'07 PDR'!$L$4:$L$5600,'05 CPD'!T$2))","v":""},{"$f":"IF(SUMIFS('07 PDR'!$F$4:$F$5600,'07 PDR'!$A$4:$A$5600,'05 CPD'!$A5,'07 PDR'!$L$4:$L$5600,'05 CPD'!U$2)=0,\"\",SUMIFS('07 PDR'!$F$4:$F$5600,'07 PDR'!$A$4:$A$5600,'05 CPD'!$A5,'07 PDR'!$L$4:$L$5600,'05 CPD'!U$2))","v":""},{"$f":"IF(SUMIFS('07 PDR'!$F$4:$F$5600,'07 PDR'!$A$4:$A$5600,'05 CPD'!$A5,'07 PDR'!$L$4:$L$5600,'05 CPD'!V$2)=0,\"\",SUMIFS('07 PDR'!$F$4:$F$5600,'07 PDR'!$A$4:$A$5600,'05 CPD'!$A5,'07 PDR'!$L$4:$L$5600,'05 CPD'!V$2))","v":""},{"$f":"IF(SUMIFS('07 PDR'!$F$4:$F$5600,'07 PDR'!$A$4:$A$5600,'05 CPD'!$A5,'07 PDR'!$L$4:$L$5600,'05 CPD'!W$2)=0,\"\",SUMIFS('07 PDR'!$F$4:$F$5600,'07 PDR'!$A$4:$A$5600,'05 CPD'!$A5,'07 PDR'!$L$4:$L$5600,'05 CPD'!W$2))","v":""},{"$f":"IF(SUMIFS('07 PDR'!$F$4:$F$5600,'07 PDR'!$A$4:$A$5600,'05 CPD'!$A5,'07 PDR'!$L$4:$L$5600,'05 CPD'!X$2)=0,\"\",SUMIFS('07 PDR'!$F$4:$F$5600,'07 PDR'!$A$4:$A$5600,'05 CPD'!$A5,'07 PDR'!$L$4:$L$5600,'05 CPD'!X$2))","v":""},{"$f":"IF(SUMIFS('07 PDR'!$F$4:$F$5600,'07 PDR'!$A$4:$A$5600,'05 CPD'!$A5,'07 PDR'!$L$4:$L$5600,'05 CPD'!Y$2)=0,\"\",SUMIFS('07 PDR'!$F$4:$F$5600,'07 PDR'!$A$4:$A$5600,'05 CPD'!$A5,'07 PDR'!$L$4:$L$5600,'05 CPD'!Y$2))","v":""},{"$f":"IF(SUMIFS('07 PDR'!$F$4:$F$5600,'07 PDR'!$A$4:$A$5600,'05 CPD'!$A5,'07 PDR'!$L$4:$L$5600,'05 CPD'!Z$2)=0,\"\",SUMIFS('07 PDR'!$F$4:$F$5600,'07 PDR'!$A$4:$A$5600,'05 CPD'!$A5,'07 PDR'!$L$4:$L$5600,'05 CPD'!Z$2))","v":""},{"$f":"IF(SUMIFS('07 PDR'!$F$4:$F$5600,'07 PDR'!$A$4:$A$5600,'05 CPD'!$A5,'07 PDR'!$L$4:$L$5600,'05 CPD'!AA$2)=0,\"\",SUMIFS('07 PDR'!$F$4:$F$5600,'07 PDR'!$A$4:$A$5600,'05 CPD'!$A5,'07 PDR'!$L$4:$L$5600,'05 CPD'!AA$2))","v":""},{"$f":"IF(SUMIFS('07 PDR'!$F$4:$F$5600,'07 PDR'!$A$4:$A$5600,'05 CPD'!$A5,'07 PDR'!$L$4:$L$5600,'05 CPD'!AB$2)=0,\"\",SUMIFS('07 PDR'!$F$4:$F$5600,'07 PDR'!$A$4:$A$5600,'05 CPD'!$A5,'07 PDR'!$L$4:$L$5600,'05 CPD'!AB$2))","v":""},{"$f":"IF(SUMIFS('07 PDR'!$F$4:$F$5600,'07 PDR'!$A$4:$A$5600,'05 CPD'!$A5,'07 PDR'!$L$4:$L$5600,'05 CPD'!AC$2)=0,\"\",SUMIFS('07 PDR'!$F$4:$F$5600,'07 PDR'!$A$4:$A$5600,'05 CPD'!$A5,'07 PDR'!$L$4:$L$5600,'05 CPD'!AC$2))","v":""},{"$f":"IF(SUMIFS('07 PDR'!$F$4:$F$5600,'07 PDR'!$A$4:$A$5600,'05 CPD'!$A5,'07 PDR'!$L$4:$L$5600,'05 CPD'!AD$2)=0,\"\",SUMIFS('07 PDR'!$F$4:$F$5600,'07 PDR'!$A$4:$A$5600,'05 CPD'!$A5,'07 PDR'!$L$4:$L$5600,'05 CPD'!AD$2))","v":""},{"$f":"IF(SUMIFS('07 PDR'!$F$4:$F$5600,'07 PDR'!$A$4:$A$5600,'05 CPD'!$A5,'07 PDR'!$L$4:$L$5600,'05 CPD'!AE$2)=0,\"\",SUMIFS('07 PDR'!$F$4:$F$5600,'07 PDR'!$A$4:$A$5600,'05 CPD'!$A5,'07 PDR'!$L$4:$L$5600,'05 CPD'!AE$2))","v":""},{"$f":"IF(SUMIFS('07 PDR'!$F$4:$F$5600,'07 PDR'!$A$4:$A$5600,'05 CPD'!$A5,'07 PDR'!$L$4:$L$5600,'05 CPD'!AF$2)=0,\"\",SUMIFS('07 PDR'!$F$4:$F$5600,'07 PDR'!$A$4:$A$5600,'05 CPD'!$A5,'07 PDR'!$L$4:$L$5600,'05 CPD'!AF$2))","v":""}]
["Sept 2010 - Aug 2011","","","",null,null,null,{"$f":"IF(SUMIFS('07 PDR'!$F$4:$F$5600,'07 PDR'!$A$4:$A$5600,'05 CPD'!$A6,'07 PDR'!$K$4:$K$5600,'05 CPD'!H$2)=0,\"\",SUMIFS('07 PDR'!$F$4:$F$5600,'07 PDR'!$A$4:$A$5600,'05 CPD'!$A6,'07 PDR'!$K$4:$K$5600,'05 CPD'!H$2))","v":""},{"$f":"IF(SUMIFS('07 PDR'!$F$4:$F$5600,'07 PDR'!$A$4:$A$5600,'05 CPD'!$A6,'07 PDR'!$K$4:$K$5600,'05 CPD'!I$2)=0,\"\",SUMIFS('07 PDR'!$F$4:$F$5600,'07 PDR'!$A$4:$A$5600,'05 CPD'!$A6,'07 PDR'!$K$4:$K$5600,'05 CPD'!I$2))","v":""},{"$f":"IF(SUMIFS('07 PDR'!$F$4:$F$5600,'07 PDR'!$A$4:$A$5600,'05 CPD'!$A6,'07 PDR'!$K$4:$K$5600,'05 CPD'!J$2)=0,\"\",SUMIFS('07 PDR'!$F$4:$F$5600,'07 PDR'!$A$4:$A$5600,'05 CPD'!$A6,'07 PDR'!$K$4:$K$5600,'05 CPD'!J$2))","v":""},{"$f":"IF(SUMIFS('07 PDR'!$F$4:$F$5600,'07 PDR'!$A$4:$A$5600,'05 CPD'!$A6,'07 PDR'!$K$4:$K$5600,'05 CPD'!K$2)=0,\"\",SUMIFS('07 PDR'!$F$4:$F$5600,'07 PDR'!$A$4:$A$5600,'05 CPD'!$A6,'07 PDR'!$K$4:$K$5600,'05 CPD'!K$2))","v":""},{"$f":"IF(SUMIFS('07 PDR'!$F$4:$F$5600,'07 PDR'!$A$4:$A$5600,'05 CPD'!$A6,'07 PDR'!$K$4:$K$5600,'05 CPD'!L$2)=0,\"\",SUMIFS('07 PDR'!$F$4:$F$5600,'07 PDR'!$A$4:$A$5600,'05 CPD'!$A6,'07 PDR'!$K$4:$K$5600,'05 CPD'!L$2))","v":""},{"$f":"IF(SUMIFS('07 PDR'!$F$4:$F$5600,'07 PDR'!$A$4:$A$5600,'05 CPD'!$A6,'07 PDR'!$K$4:$K$5600,'05 CPD'!M$2)=0,\"\",SUMIFS('07 PDR'!$F$4:$F$5600,'07 PDR'!$A$4:$A$5600,'05 CPD'!$A6,'07 PDR'!$K$4:$K$5600,'05 CPD'!M$2))","v":""},{"$f":"IF(SUMIFS('07 PDR'!$F$4:$F$5600,'07 PDR'!$A$4:$A$5600,'05 CPD'!$A6,'07 PDR'!$K$4:$K$5600,'05 CPD'!N$2)=0,\"\",SUMIFS('07 PDR'!$F$4:$F$5600,'07 PDR'!$A$4:$A$5600,'05 CPD'!$A6,'07 PDR'!$K$4:$K$5600,'05 CPD'!N$2))","v":""},{"$f":"IF(SUMIFS('07 PDR'!$F$4:$F$5600,'07 PDR'!$A$4:$A$5600,'05 CPD'!$A6,'07 PDR'!$K$4:$K$5600,'05 CPD'!O$2)=0,\"\",SUMIFS('07 PDR'!$F$4:$F$5600,'07 PDR'!$A$4:$A$5600,'05 CPD'!$A6,'07 PDR'!$K$4:$K$5600,'05 CPD'!O$2))","v":""},{"$f":"IF(SUMIFS('07 PDR'!$F$4:$F$5600,'07 PDR'!$A$4:$A$5600,'05 CPD'!$A6,'07 PDR'!$K$4:$K$5600,'05 CPD'!P$2)=0,\"\",SUMIFS('07 PDR'!$F$4:$F$5600,'07 PDR'!$A$4:$A$5600,'05 CPD'!$A6,'07 PDR'!$K$4:$K$5600,'05 CPD'!P$2))","v":""},{"$f":"IF(SUMIFS('07 PDR'!$F$4:$F$5600,'07 PDR'!$A$4:$A$5600,'05 CPD'!$A6,'07 PDR'!$K$4:$K$5600,'05 CPD'!Q$2)=0,\"\",SUMIFS('07 PDR'!$F$4:$F$5600,'07 PDR'!$A$4:$A$5600,'05 CPD'!$A6,'07 PDR'!$K$4:$K$5600,'05 CPD'!Q$2))","v":""},{"$f":"IF(SUMIFS('07 PDR'!$F$4:$F$5600,'07 PDR'!$A$4:$A$5600,'05 CPD'!$A6,'07 PDR'!$K$4:$K$5600,'05 CPD'!R$2)=0,\"\",SUMIFS('07 PDR'!$F$4:$F$5600,'07 PDR'!$A$4:$A$5600,'05 CPD'!$A6,'07 PDR'!$K$4:$K$5600,'05 CPD'!R$2))","v":""},null,{"$f":"IF(SUMIFS('07 PDR'!$F$4:$F$5600,'07 PDR'!$A$4:$A$5600,'05 CPD'!$A6,'07 PDR'!$L$4:$L$5600,'05 CPD'!T$2)=0,\"\",SUMIFS('07 PDR'!$F$4:$F$5600,'07 PDR'!$A$4:$A$5600,'05 CPD'!$A6,'07 PDR'!$L$4:$L$5600,'05 CPD'!T$2))","v":""},{"$f":"IF(SUMIFS('07 PDR'!$F$4:$F$5600,'07 PDR'!$A$4:$A$5600,'05 CPD'!$A6,'07 PDR'!$L$4:$L$5600,'05 CPD'!U$2)=0,\"\",SUMIFS('07 PDR'!$F$4:$F$5600,'07 PDR'!$A$4:$A$5600,'05 CPD'!$A6,'07 PDR'!$L$4:$L$5600,'05 CPD'!U$2))","v":""},{"$f":"IF(SUMIFS('07 PDR'!$F$4:$F$5600,'07 PDR'!$A$4:$A$5600,'05 CPD'!$A6,'07 PDR'!$L$4:$L$5600,'05 CPD'!V$2)=0,\"\",SUMIFS('07 PDR'!$F$4:$F$5600,'07 PDR'!$A$4:$A$5600,'05 CPD'!$A6,'07 PDR'!$L$4:$L$5600,'05 CPD'!V$2))","v":""},{"$f":"IF(SUMIFS('07 PDR'!$F$4:$F$5600,'07 PDR'!$A$4:$A$5600,'05 CPD'!$A6,'07 PDR'!$L$4:$L$5600,'05 CPD'!W$2)=0,\"\",SUMIFS('07 PDR'!$F$4:$F$5600,'07 PDR'!$A$4:$A$5600,'05 CPD'!$A6,'07 PDR'!$L$4:$L$5600,'05 CPD'!W$2))","v":""},{"$f":"IF(SUMIFS('07 PDR'!$F$4:$F$5600,'07 PDR'!$A$4:$A$5600,'05 CPD'!$A6,'07 PDR'!$L$4:$L$5600,'05 CPD'!X$2)=0,\"\",SUMIFS('07 PDR'!$F$4:$F$5600,'07 PDR'!$A$4:$A$5600,'05 CPD'!$A6,'07 PDR'!$L$4:$L$5600,'05 CPD'!X$2))","v":""},{"$f":"IF(SUMIFS('07 PDR'!$F$4:$F$5600,'07 PDR'!$A$4:$A$5600,'05 CPD'!$A6,'07 PDR'!$L$4:$L$5600,'05 CPD'!Y$2)=0,\"\",SUMIFS('07 PDR'!$F$4:$F$5600,'07 PDR'!$A$4:$A$5600,'05 CPD'!$A6,'07 PDR'!$L$4:$L$5600,'05 CPD'!Y$2))","v":""},{"$f":"IF(SUMIFS('07 PDR'!$F$4:$F$5600,'07 PDR'!$A$4:$A$5600,'05 CPD'!$A6,'07 PDR'!$L$4:$L$5600,'05 CPD'!Z$2)=0,\"\",SUMIFS('07 PDR'!$F$4:$F$5600,'07 PDR'!$A$4:$A$5600,'05 CPD'!$A6,'07 PDR'!$L$4:$L$5600,'05 CPD'!Z$2))","v":""},{"$f":"IF(SUMIFS('07 PDR'!$F$4:$F$5600,'07 PDR'!$A$4:$A$5600,'05 CPD'!$A6,'07 PDR'!$L$4:$L$5600,'05 CPD'!AA$2)=0,\"\",SUMIFS('07 PDR'!$F$4:$F$5600,'07 PDR'!$A$4:$A$5600,'05 CPD'!$A6,'07 PDR'!$L$4:$L$5600,'05 CPD'!AA$2))","v":""},{"$f":"IF(SUMIFS('07 PDR'!$F$4:$F$5600,'07 PDR'!$A$4:$A$5600,'05 CPD'!$A6,'07 PDR'!$L$4:$L$5600,'05 CPD'!AB$2)=0,\"\",SUMIFS('07 PDR'!$F$4:$F$5600,'07 PDR'!$A$4:$A$5600,'05 CPD'!$A6,'07 PDR'!$L$4:$L$5600,'05 CPD'!AB$2))","v":""},{"$f":"IF(SUMIFS('07 PDR'!$F$4:$F$5600,'07 PDR'!$A$4:$A$5600,'05 CPD'!$A6,'07 PDR'!$L$4:$L$5600,'05 CPD'!AC$2)=0,\"\",SUMIFS('07 PDR'!$F$4:$F$5600,'07 PDR'!$A$4:$A$5600,'05 CPD'!$A6,'07 PDR'!$L$4:$L$5600,'05 CPD'!AC$2))","v":""},{"$f":"IF(SUMIFS('07 PDR'!$F$4:$F$5600,'07 PDR'!$A$4:$A$5600,'05 CPD'!$A6,'07 PDR'!$L$4:$L$5600,'05 CPD'!AD$2)=0,\"\",SUMIFS('07 PDR'!$F$4:$F$5600,'07 PDR'!$A$4:$A$5600,'05 CPD'!$A6,'07 PDR'!$L$4:$L$5600,'05 CPD'!AD$2))","v":""},{"$f":"IF(SUMIFS('07 PDR'!$F$4:$F$5600,'07 PDR'!$A$4:$A$5600,'05 CPD'!$A6,'07 PDR'!$L$4:$L$5600,'05 CPD'!AE$2)=0,\"\",SUMIFS('07 PDR'!$F$4:$F$5600,'07 PDR'!$A$4:$A$5600,'05 CPD'!$A6,'07 PDR'!$L$4:$L$5600,'05 CPD'!AE$2))","v":""},{"$f":"IF(SUMIFS('07 PDR'!$F$4:$F$5600,'07 PDR'!$A$4:$A$5600,'05 CPD'!$A6,'07 PDR'!$L$4:$L$5600,'05 CPD'!AF$2)=0,\"\",SUMIFS('07 PDR'!$F$4:$F$5600,'07 PDR'!$A$4:$A$5600,'05 CPD'!$A6,'07 PDR'!$L$4:$L$5600,'05 CPD'!AF$2))","v":""}]
["Sept 2011 - Aug 2012","","","",null,null,null,{"$f":"IF(SUMIFS('07 PDR'!$F$4:$F$5600,'07 PDR'!$A$4:$A$5600,'05 CPD'!$A7,'07 PDR'!$K$4:$K$5600,'05 CPD'!H$2)=0,\"\",SUMIFS('07 PDR'!$F$4:$F$5600,'07 PDR'!$A$4:$A$5600,'05 CPD'!$A7,'07 PDR'!$K$4:$K$5600,'05 CPD'!H$2))","v":""},{"$f":"IF(SUMIFS('07 PDR'!$F$4:$F$5600,'07 PDR'!$A$4:$A$5600,'05 CPD'!$A7,'07 PDR'!$K$4:$K$5600,'05 CPD'!I$2)=0,\"\",SUMIFS('07 PDR'!$F$4:$F$5600,'07 PDR'!$A$4:$A$5600,'05 CPD'!$A7,'07 PDR'!$K$4:$K$5600,'05 CPD'!I$2))","v":""},{"$f":"IF(SUMIFS('07 PDR'!$F$4:$F$5600,'07 PDR'!$A$4:$A$5600,'05 CPD'!$A7,'07 PDR'!$K$4:$K$5600,'05 CPD'!J$2)=0,\"\",SUMIFS('07 PDR'!$F$4:$F$5600,'07 PDR'!$A$4:$A$5600,'05 CPD'!$A7,'07 PDR'!$K$4:$K$5600,'05 CPD'!J$2))","v":""},{"$f":"IF(SUMIFS('07 PDR'!$F$4:$F$5600,'07 PDR'!$A$4:$A$5600,'05 CPD'!$A7,'07 PDR'!$K$4:$K$5600,'05 CPD'!K$2)=0,\"\",SUMIFS('07 PDR'!$F$4:$F$5600,'07 PDR'!$A$4:$A$5600,'05 CPD'!$A7,'07 PDR'!$K$4:$K$5600,'05 CPD'!K$2))","v":""},{"$f":"IF(SUMIFS('07 PDR'!$F$4:$F$5600,'07 PDR'!$A$4:$A$5600,'05 CPD'!$A7,'07 PDR'!$K$4:$K$5600,'05 CPD'!L$2)=0,\"\",SUMIFS('07 PDR'!$F$4:$F$5600,'07 PDR'!$A$4:$A$5600,'05 CPD'!$A7,'07 PDR'!$K$4:$K$5600,'05 CPD'!L$2))","v":""},{"$f":"IF(SUMIFS('07 PDR'!$F$4:$F$5600,'07 PDR'!$A$4:$A$5600,'05 CPD'!$A7,'07 PDR'!$K$4:$K$5600,'05 CPD'!M$2)=0,\"\",SUMIFS('07 PDR'!$F$4:$F$5600,'07 PDR'!$A$4:$A$5600,'05 CPD'!$A7,'07 PDR'!$K$4:$K$5600,'05 CPD'!M$2))","v":""},{"$f":"IF(SUMIFS('07 PDR'!$F$4:$F$5600,'07 PDR'!$A$4:$A$5600,'05 CPD'!$A7,'07 PDR'!$K$4:$K$5600,'05 CPD'!N$2)=0,\"\",SUMIFS('07 PDR'!$F$4:$F$5600,'07 PDR'!$A$4:$A$5600,'05 CPD'!$A7,'07 PDR'!$K$4:$K$5600,'05 CPD'!N$2))","v":""},{"$f":"IF(SUMIFS('07 PDR'!$F$4:$F$5600,'07 PDR'!$A$4:$A$5600,'05 CPD'!$A7,'07 PDR'!$K$4:$K$5600,'05 CPD'!O$2)=0,\"\",SUMIFS('07 PDR'!$F$4:$F$5600,'07 PDR'!$A$4:$A$5600,'05 CPD'!$A7,'07 PDR'!$K$4:$K$5600,'05 CPD'!O$2))","v":""},{"$f":"IF(SUMIFS('07 PDR'!$F$4:$F$5600,'07 PDR'!$A$4:$A$5600,'05 CPD'!$A7,'07 PDR'!$K$4:$K$5600,'05 CPD'!P$2)=0,\"\",SUMIFS('07 PDR'!$F$4:$F$5600,'07 PDR'!$A$4:$A$5600,'05 CPD'!$A7,'07 PDR'!$K$4:$K$5600,'05 CPD'!P$2))","v":""},{"$f":"IF(SUMIFS('07 PDR'!$F$4:$F$5600,'07 PDR'!$A$4:$A$5600,'05 CPD'!$A7,'07 PDR'!$K$4:$K$5600,'05 CPD'!Q$2)=0,\"\",SUMIFS('07 PDR'!$F$4:$F$5600,'07 PDR'!$A$4:$A$5600,'05 CPD'!$A7,'07 PDR'!$K$4:$K$5600,'05 CPD'!Q$2))","v":""},{"$f":"IF(SUMIFS('07 PDR'!$F$4:$F$5600,'07 PDR'!$A$4:$A$5600,'05 CPD'!$A7,'07 PDR'!$K$4:$K$5600,'05 CPD'!R$2)=0,\"\",SUMIFS('07 PDR'!$F$4:$F$5600,'07 PDR'!$A$4:$A$5600,'05 CPD'!$A7,'07 PDR'!$K$4:$K$5600,'05 CPD'!R$2))","v":""},null,{"$f":"IF(SUMIFS('07 PDR'!$F$4:$F$5600,'07 PDR'!$A$4:$A$5600,'05 CPD'!$A7,'07 PDR'!$L$4:$L$5600,'05 CPD'!T$2)=0,\"\",SUMIFS('07 PDR'!$F$4:$F$5600,'07 PDR'!$A$4:$A$5600,'05 CPD'!$A7,'07 PDR'!$L$4:$L$5600,'05 CPD'!T$2))","v":""},{"$f":"IF(SUMIFS('07 PDR'!$F$4:$F$5600,'07 PDR'!$A$4:$A$5600,'05 CPD'!$A7,'07 PDR'!$L$4:$L$5600,'05 CPD'!U$2)=0,\"\",SUMIFS('07 PDR'!$F$4:$F$5600,'07 PDR'!$A$4:$A$5600,'05 CPD'!$A7,'07 PDR'!$L$4:$L$5600,'05 CPD'!U$2))","v":""},{"$f":"IF(SUMIFS('07 PDR'!$F$4:$F$5600,'07 PDR'!$A$4:$A$5600,'05 CPD'!$A7,'07 PDR'!$L$4:$L$5600,'05 CPD'!V$2)=0,\"\",SUMIFS('07 PDR'!$F$4:$F$5600,'07 PDR'!$A$4:$A$5600,'05 CPD'!$A7,'07 PDR'!$L$4:$L$5600,'05 CPD'!V$2))","v":""},{"$f":"IF(SUMIFS('07 PDR'!$F$4:$F$5600,'07 PDR'!$A$4:$A$5600,'05 CPD'!$A7,'07 PDR'!$L$4:$L$5600,'05 CPD'!W$2)=0,\"\",SUMIFS('07 PDR'!$F$4:$F$5600,'07 PDR'!$A$4:$A$5600,'05 CPD'!$A7,'07 PDR'!$L$4:$L$5600,'05 CPD'!W$2))","v":""},{"$f":"IF(SUMIFS('07 PDR'!$F$4:$F$5600,'07 PDR'!$A$4:$A$5600,'05 CPD'!$A7,'07 PDR'!$L$4:$L$5600,'05 CPD'!X$2)=0,\"\",SUMIFS('07 PDR'!$F$4:$F$5600,'07 PDR'!$A$4:$A$5600,'05 CPD'!$A7,'07 PDR'!$L$4:$L$5600,'05 CPD'!X$2))","v":""},{"$f":"IF(SUMIFS('07 PDR'!$F$4:$F$5600,'07 PDR'!$A$4:$A$5600,'05 CPD'!$A7,'07 PDR'!$L$4:$L$5600,'05 CPD'!Y$2)=0,\"\",SUMIFS('07 PDR'!$F$4:$F$5600,'07 PDR'!$A$4:$A$5600,'05 CPD'!$A7,'07 PDR'!$L$4:$L$5600,'05 CPD'!Y$2))","v":""},{"$f":"IF(SUMIFS('07 PDR'!$F$4:$F$5600,'07 PDR'!$A$4:$A$5600,'05 CPD'!$A7,'07 PDR'!$L$4:$L$5600,'05 CPD'!Z$2)=0,\"\",SUMIFS('07 PDR'!$F$4:$F$5600,'07 PDR'!$A$4:$A$5600,'05 CPD'!$A7,'07 PDR'!$L$4:$L$5600,'05 CPD'!Z$2))","v":""},{"$f":"IF(SUMIFS('07 PDR'!$F$4:$F$5600,'07 PDR'!$A$4:$A$5600,'05 CPD'!$A7,'07 PDR'!$L$4:$L$5600,'05 CPD'!AA$2)=0,\"\",SUMIFS('07 PDR'!$F$4:$F$5600,'07 PDR'!$A$4:$A$5600,'05 CPD'!$A7,'07 PDR'!$L$4:$L$5600,'05 CPD'!AA$2))","v":""},{"$f":"IF(SUMIFS('07 PDR'!$F$4:$F$5600,'07 PDR'!$A$4:$A$5600,'05 CPD'!$A7,'07 PDR'!$L$4:$L$5600,'05 CPD'!AB$2)=0,\"\",SUMIFS('07 PDR'!$F$4:$F$5600,'07 PDR'!$A$4:$A$5600,'05 CPD'!$A7,'07 PDR'!$L$4:$L$5600,'05 CPD'!AB$2))","v":""},{"$f":"IF(SUMIFS('07 PDR'!$F$4:$F$5600,'07 PDR'!$A$4:$A$5600,'05 CPD'!$A7,'07 PDR'!$L$4:$L$5600,'05 CPD'!AC$2)=0,\"\",SUMIFS('07 PDR'!$F$4:$F$5600,'07 PDR'!$A$4:$A$5600,'05 CPD'!$A7,'07 PDR'!$L$4:$L$5600,'05 CPD'!AC$2))","v":""},{"$f":"IF(SUMIFS('07 PDR'!$F$4:$F$5600,'07 PDR'!$A$4:$A$5600,'05 CPD'!$A7,'07 PDR'!$L$4:$L$5600,'05 CPD'!AD$2)=0,\"\",SUMIFS('07 PDR'!$F$4:$F$5600,'07 PDR'!$A$4:$A$5600,'05 CPD'!$A7,'07 PDR'!$L$4:$L$5600,'05 CPD'!AD$2))","v":""},{"$f":"IF(SUMIFS('07 PDR'!$F$4:$F$5600,'07 PDR'!$A$4:$A$5600,'05 CPD'!$A7,'07 PDR'!$L$4:$L$5600,'05 CPD'!AE$2)=0,\"\",SUMIFS('07 PDR'!$F$4:$F$5600,'07 PDR'!$A$4:$A$5600,'05 CPD'!$A7,'07 PDR'!$L$4:$L$5600,'05 CPD'!AE$2))","v":""},{"$f":"IF(SUMIFS('07 PDR'!$F$4:$F$5600,'07 PDR'!$A$4:$A$5600,'05 CPD'!$A7,'07 PDR'!$L$4:$L$5600,'05 CPD'!AF$2)=0,\"\",SUMIFS('07 PDR'!$F$4:$F$5600,'07 PDR'!$A$4:$A$5600,'05 CPD'!$A7,'07 PDR'!$L$4:$L$5600,'05 CPD'!AF$2))","v":""}]
["Sept 2012 - Aug 2013","","","",null,null,null,{"$f":"IF(SUMIFS('07 PDR'!$F$4:$F$5600,'07 PDR'!$A$4:$A$5600,'05 CPD'!$A8,'07 PDR'!$K$4:$K$5600,'05 CPD'!H$2)=0,\"\",SUMIFS('07 PDR'!$F$4:$F$5600,'07 PDR'!$A$4:$A$5600,'05 CPD'!$A8,'07 PDR'!$K$4:$K$5600,'05 CPD'!H$2))","v":""},{"$f":"IF(SUMIFS('07 PDR'!$F$4:$F$5600,'07 PDR'!$A$4:$A$5600,'05 CPD'!$A8,'07 PDR'!$K$4:$K$5600,'05 CPD'!I$2)=0,\"\",SUMIFS('07 PDR'!$F$4:$F$5600,'07 PDR'!$A$4:$A$5600,'05 CPD'!$A8,'07 PDR'!$K$4:$K$5600,'05 CPD'!I$2))","v":""},{"$f":"IF(SUMIFS('07 PDR'!$F$4:$F$5600,'07 PDR'!$A$4:$A$5600,'05 CPD'!$A8,'07 PDR'!$K$4:$K$5600,'05 CPD'!J$2)=0,\"\",SUMIFS('07 PDR'!$F$4:$F$5600,'07 PDR'!$A$4:$A$5600,'05 CPD'!$A8,'07 PDR'!$K$4:$K$5600,'05 CPD'!J$2))","v":""},{"$f":"IF(SUMIFS('07 PDR'!$F$4:$F$5600,'07 PDR'!$A$4:$A$5600,'05 CPD'!$A8,'07 PDR'!$K$4:$K$5600,'05 CPD'!K$2)=0,\"\",SUMIFS('07 PDR'!$F$4:$F$5600,'07 PDR'!$A$4:$A$5600,'05 CPD'!$A8,'07 PDR'!$K$4:$K$5600,'05 CPD'!K$2))","v":""},{"$f":"IF(SUMIFS('07 PDR'!$F$4:$F$5600,'07 PDR'!$A$4:$A$5600,'05 CPD'!$A8,'07 PDR'!$K$4:$K$5600,'05 CPD'!L$2)=0,\"\",SUMIFS('07 PDR'!$F$4:$F$5600,'07 PDR'!$A$4:$A$5600,'05 CPD'!$A8,'07 PDR'!$K$4:$K$5600,'05 CPD'!L$2))","v":""},{"$f":"IF(SUMIFS('07 PDR'!$F$4:$F$5600,'07 PDR'!$A$4:$A$5600,'05 CPD'!$A8,'07 PDR'!$K$4:$K$5600,'05 CPD'!M$2)=0,\"\",SUMIFS('07 PDR'!$F$4:$F$5600,'07 PDR'!$A$4:$A$5600,'05 CPD'!$A8,'07 PDR'!$K$4:$K$5600,'05 CPD'!M$2))","v":""},{"$f":"IF(SUMIFS('07 PDR'!$F$4:$F$5600,'07 PDR'!$A$4:$A$5600,'05 CPD'!$A8,'07 PDR'!$K$4:$K$5600,'05 CPD'!N$2)=0,\"\",SUMIFS('07 PDR'!$F$4:$F$5600,'07 PDR'!$A$4:$A$5600,'05 CPD'!$A8,'07 PDR'!$K$4:$K$5600,'05 CPD'!N$2))","v":""},{"$f":"IF(SUMIFS('07 PDR'!$F$4:$F$5600,'07 PDR'!$A$4:$A$5600,'05 CPD'!$A8,'07 PDR'!$K$4:$K$5600,'05 CPD'!O$2)=0,\"\",SUMIFS('07 PDR'!$F$4:$F$5600,'07 PDR'!$A$4:$A$5600,'05 CPD'!$A8,'07 PDR'!$K$4:$K$5600,'05 CPD'!O$2))","v":""},{"$f":"IF(SUMIFS('07 PDR'!$F$4:$F$5600,'07 PDR'!$A$4:$A$5600,'05 CPD'!$A8,'07 PDR'!$K$4:$K$5600,'05 CPD'!P$2)=0,\"\",SUMIFS('07 PDR'!$F$4:$F$5600,'07 PDR'!$A$4:$A$5600,'05 CPD'!$A8,'07 PDR'!$K$4:$K$5600,'05 CPD'!P$2))","v":""},{"$f":"IF(SUMIFS('07 PDR'!$F$4:$F$5600,'07 PDR'!$A$4:$A$5600,'05 CPD'!$A8,'07 PDR'!$K$4:$K$5600,'05 CPD'!Q$2)=0,\"\",SUMIFS('07 PDR'!$F$4:$F$5600,'07 PDR'!$A$4:$A$5600,'05 CPD'!$A8,'07 PDR'!$K$4:$K$5600,'05 CPD'!Q$2))","v":""},{"$f":"IF(SUMIFS('07 PDR'!$F$4:$F$5600,'07 PDR'!$A$4:$A$5600,'05 CPD'!$A8,'07 PDR'!$K$4:$K$5600,'05 CPD'!R$2)=0,\"\",SUMIFS('07 PDR'!$F$4:$F$5600,'07 PDR'!$A$4:$A$5600,'05 CPD'!$A8,'07 PDR'!$K$4:$K$5600,'05 CPD'!R$2))","v":""},null,{"$f":"IF(SUMIFS('07 PDR'!$F$4:$F$5600,'07 PDR'!$A$4:$A$5600,'05 CPD'!$A8,'07 PDR'!$L$4:$L$5600,'05 CPD'!T$2)=0,\"\",SUMIFS('07 PDR'!$F$4:$F$5600,'07 PDR'!$A$4:$A$5600,'05 CPD'!$A8,'07 PDR'!$L$4:$L$5600,'05 CPD'!T$2))","v":""},{"$f":"IF(SUMIFS('07 PDR'!$F$4:$F$5600,'07 PDR'!$A$4:$A$5600,'05 CPD'!$A8,'07 PDR'!$L$4:$L$5600,'05 CPD'!U$2)=0,\"\",SUMIFS('07 PDR'!$F$4:$F$5600,'07 PDR'!$A$4:$A$5600,'05 CPD'!$A8,'07 PDR'!$L$4:$L$5600,'05 CPD'!U$2))","v":""},{"$f":"IF(SUMIFS('07 PDR'!$F$4:$F$5600,'07 PDR'!$A$4:$A$5600,'05 CPD'!$A8,'07 PDR'!$L$4:$L$5600,'05 CPD'!V$2)=0,\"\",SUMIFS('07 PDR'!$F$4:$F$5600,'07 PDR'!$A$4:$A$5600,'05 CPD'!$A8,'07 PDR'!$L$4:$L$5600,'05 CPD'!V$2))","v":""},{"$f":"IF(SUMIFS('07 PDR'!$F$4:$F$5600,'07 PDR'!$A$4:$A$5600,'05 CPD'!$A8,'07 PDR'!$L$4:$L$5600,'05 CPD'!W$2)=0,\"\",SUMIFS('07 PDR'!$F$4:$F$5600,'07 PDR'!$A$4:$A$5600,'05 CPD'!$A8,'07 PDR'!$L$4:$L$5600,'05 CPD'!W$2))","v":""},{"$f":"IF(SUMIFS('07 PDR'!$F$4:$F$5600,'07 PDR'!$A$4:$A$5600,'05 CPD'!$A8,'07 PDR'!$L$4:$L$5600,'05 CPD'!X$2)=0,\"\",SUMIFS('07 PDR'!$F$4:$F$5600,'07 PDR'!$A$4:$A$5600,'05 CPD'!$A8,'07 PDR'!$L$4:$L$5600,'05 CPD'!X$2))","v":""},{"$f":"IF(SUMIFS('07 PDR'!$F$4:$F$5600,'07 PDR'!$A$4:$A$5600,'05 CPD'!$A8,'07 PDR'!$L$4:$L$5600,'05 CPD'!Y$2)=0,\"\",SUMIFS('07 PDR'!$F$4:$F$5600,'07 PDR'!$A$4:$A$5600,'05 CPD'!$A8,'07 PDR'!$L$4:$L$5600,'05 CPD'!Y$2))","v":""},{"$f":"IF(SUMIFS('07 PDR'!$F$4:$F$5600,'07 PDR'!$A$4:$A$5600,'05 CPD'!$A8,'07 PDR'!$L$4:$L$5600,'05 CPD'!Z$2)=0,\"\",SUMIFS('07 PDR'!$F$4:$F$5600,'07 PDR'!$A$4:$A$5600,'05 CPD'!$A8,'07 PDR'!$L$4:$L$5600,'05 CPD'!Z$2))","v":""},{"$f":"IF(SUMIFS('07 PDR'!$F$4:$F$5600,'07 PDR'!$A$4:$A$5600,'05 CPD'!$A8,'07 PDR'!$L$4:$L$5600,'05 CPD'!AA$2)=0,\"\",SUMIFS('07 PDR'!$F$4:$F$5600,'07 PDR'!$A$4:$A$5600,'05 CPD'!$A8,'07 PDR'!$L$4:$L$5600,'05 CPD'!AA$2))","v":""},{"$f":"IF(SUMIFS('07 PDR'!$F$4:$F$5600,'07 PDR'!$A$4:$A$5600,'05 CPD'!$A8,'07 PDR'!$L$4:$L$5600,'05 CPD'!AB$2)=0,\"\",SUMIFS('07 PDR'!$F$4:$F$5600,'07 PDR'!$A$4:$A$5600,'05 CPD'!$A8,'07 PDR'!$L$4:$L$5600,'05 CPD'!AB$2))","v":""},{"$f":"IF(SUMIFS('07 PDR'!$F$4:$F$5600,'07 PDR'!$A$4:$A$5600,'05 CPD'!$A8,'07 PDR'!$L$4:$L$5600,'05 CPD'!AC$2)=0,\"\",SUMIFS('07 PDR'!$F$4:$F$5600,'07 PDR'!$A$4:$A$5600,'05 CPD'!$A8,'07 PDR'!$L$4:$L$5600,'05 CPD'!AC$2))","v":""},{"$f":"IF(SUMIFS('07 PDR'!$F$4:$F$5600,'07 PDR'!$A$4:$A$5600,'05 CPD'!$A8,'07 PDR'!$L$4:$L$5600,'05 CPD'!AD$2)=0,\"\",SUMIFS('07 PDR'!$F$4:$F$5600,'07 PDR'!$A$4:$A$5600,'05 CPD'!$A8,'07 PDR'!$L$4:$L$5600,'05 CPD'!AD$2))","v":""},{"$f":"IF(SUMIFS('07 PDR'!$F$4:$F$5600,'07 PDR'!$A$4:$A$5600,'05 CPD'!$A8,'07 PDR'!$L$4:$L$5600,'05 CPD'!AE$2)=0,\"\",SUMIFS('07 PDR'!$F$4:$F$5600,'07 PDR'!$A$4:$A$5600,'05 CPD'!$A8,'07 PDR'!$L$4:$L$5600,'05 CPD'!AE$2))","v":""},{"$f":"IF(SUMIFS('07 PDR'!$F$4:$F$5600,'07 PDR'!$A$4:$A$5600,'05 CPD'!$A8,'07 PDR'!$L$4:$L$5600,'05 CPD'!AF$2)=0,\"\",SUMIFS('07 PDR'!$F$4:$F$5600,'07 PDR'!$A$4:$A$5600,'05 CPD'!$A8,'07 PDR'!$L$4:$L$5600,'05 CPD'!AF$2))","v":""}]
["Sept 2013 - Dec 2014","","","",null,null,null,{"$f":"IF(SUMIFS('07 PDR'!$F$4:$F$5600,'07 PDR'!$A$4:$A$5600,'05 CPD'!$A9,'07 PDR'!$K$4:$K$5600,'05 CPD'!H$2)=0,\"\",SUMIFS('07 PDR'!$F$4:$F$5600,'07 PDR'!$A$4:$A$5600,'05 CPD'!$A9,'07 PDR'!$K$4:$K$5600,'05 CPD'!H$2))","v":""},{"$f":"IF(SUMIFS('07 PDR'!$F$4:$F$5600,'07 PDR'!$A$4:$A$5600,'05 CPD'!$A9,'07 PDR'!$K$4:$K$5600,'05 CPD'!I$2)=0,\"\",SUMIFS('07 PDR'!$F$4:$F$5600,'07 PDR'!$A$4:$A$5600,'05 CPD'!$A9,'07 PDR'!$K$4:$K$5600,'05 CPD'!I$2))","v":""},{"$f":"IF(SUMIFS('07 PDR'!$F$4:$F$5600,'07 PDR'!$A$4:$A$5600,'05 CPD'!$A9,'07 PDR'!$K$4:$K$5600,'05 CPD'!J$2)=0,\"\",SUMIFS('07 PDR'!$F$4:$F$5600,'07 PDR'!$A$4:$A$5600,'05 CPD'!$A9,'07 PDR'!$K$4:$K$5600,'05 CPD'!J$2))","v":""},{"$f":"IF(SUMIFS('07 PDR'!$F$4:$F$5600,'07 PDR'!$A$4:$A$5600,'05 CPD'!$A9,'07 PDR'!$K$4:$K$5600,'05 CPD'!K$2)=0,\"\",SUMIFS('07 PDR'!$F$4:$F$5600,'07 PDR'!$A$4:$A$5600,'05 CPD'!$A9,'07 PDR'!$K$4:$K$5600,'05 CPD'!K$2))","v":""},{"$f":"IF(SUMIFS('07 PDR'!$F$4:$F$5600,'07 PDR'!$A$4:$A$5600,'05 CPD'!$A9,'07 PDR'!$K$4:$K$5600,'05 CPD'!L$2)=0,\"\",SUMIFS('07 PDR'!$F$4:$F$5600,'07 PDR'!$A$4:$A$5600,'05 CPD'!$A9,'07 PDR'!$K$4:$K$5600,'05 CPD'!L$2))","v":""},{"$f":"IF(SUMIFS('07 PDR'!$F$4:$F$5600,'07 PDR'!$A$4:$A$5600,'05 CPD'!$A9,'07 PDR'!$K$4:$K$5600,'05 CPD'!M$2)=0,\"\",SUMIFS('07 PDR'!$F$4:$F$5600,'07 PDR'!$A$4:$A$5600,'05 CPD'!$A9,'07 PDR'!$K$4:$K$5600,'05 CPD'!M$2))","v":""},{"$f":"IF(SUMIFS('07 PDR'!$F$4:$F$5600,'07 PDR'!$A$4:$A$5600,'05 CPD'!$A9,'07 PDR'!$K$4:$K$5600,'05 CPD'!N$2)=0,\"\",SUMIFS('07 PDR'!$F$4:$F$5600,'07 PDR'!$A$4:$A$5600,'05 CPD'!$A9,'07 PDR'!$K$4:$K$5600,'05 CPD'!N$2))","v":""},{"$f":"IF(SUMIFS('07 PDR'!$F$4:$F$5600,'07 PDR'!$A$4:$A$5600,'05 CPD'!$A9,'07 PDR'!$K$4:$K$5600,'05 CPD'!O$2)=0,\"\",SUMIFS('07 PDR'!$F$4:$F$5600,'07 PDR'!$A$4:$A$5600,'05 CPD'!$A9,'07 PDR'!$K$4:$K$5600,'05 CPD'!O$2))","v":""},{"$f":"IF(SUMIFS('07 PDR'!$F$4:$F$5600,'07 PDR'!$A$4:$A$5600,'05 CPD'!$A9,'07 PDR'!$K$4:$K$5600,'05 CPD'!P$2)=0,\"\",SUMIFS('07 PDR'!$F$4:$F$5600,'07 PDR'!$A$4:$A$5600,'05 CPD'!$A9,'07 PDR'!$K$4:$K$5600,'05 CPD'!P$2))","v":""},{"$f":"IF(SUMIFS('07 PDR'!$F$4:$F$5600,'07 PDR'!$A$4:$A$5600,'05 CPD'!$A9,'07 PDR'!$K$4:$K$5600,'05 CPD'!Q$2)=0,\"\",SUMIFS('07 PDR'!$F$4:$F$5600,'07 PDR'!$A$4:$A$5600,'05 CPD'!$A9,'07 PDR'!$K$4:$K$5600,'05 CPD'!Q$2))","v":""},{"$f":"IF(SUMIFS('07 PDR'!$F$4:$F$5600,'07 PDR'!$A$4:$A$5600,'05 CPD'!$A9,'07 PDR'!$K$4:$K$5600,'05 CPD'!R$2)=0,\"\",SUMIFS('07 PDR'!$F$4:$F$5600,'07 PDR'!$A$4:$A$5600,'05 CPD'!$A9,'07 PDR'!$K$4:$K$5600,'05 CPD'!R$2))","v":""},null,{"$f":"IF(SUMIFS('07 PDR'!$F$4:$F$5600,'07 PDR'!$A$4:$A$5600,'05 CPD'!$A9,'07 PDR'!$L$4:$L$5600,'05 CPD'!T$2)=0,\"\",SUMIFS('07 PDR'!$F$4:$F$5600,'07 PDR'!$A$4:$A$5600,'05 CPD'!$A9,'07 PDR'!$L$4:$L$5600,'05 CPD'!T$2))","v":""},{"$f":"IF(SUMIFS('07 PDR'!$F$4:$F$5600,'07 PDR'!$A$4:$A$5600,'05 CPD'!$A9,'07 PDR'!$L$4:$L$5600,'05 CPD'!U$2)=0,\"\",SUMIFS('07 PDR'!$F$4:$F$5600,'07 PDR'!$A$4:$A$5600,'05 CPD'!$A9,'07 PDR'!$L$4:$L$5600,'05 CPD'!U$2))","v":""},{"$f":"IF(SUMIFS('07 PDR'!$F$4:$F$5600,'07 PDR'!$A$4:$A$5600,'05 CPD'!$A9,'07 PDR'!$L$4:$L$5600,'05 CPD'!V$2)=0,\"\",SUMIFS('07 PDR'!$F$4:$F$5600,'07 PDR'!$A$4:$A$5600,'05 CPD'!$A9,'07 PDR'!$L$4:$L$5600,'05 CPD'!V$2))","v":""},{"$f":"IF(SUMIFS('07 PDR'!$F$4:$F$5600,'07 PDR'!$A$4:$A$5600,'05 CPD'!$A9,'07 PDR'!$L$4:$L$5600,'05 CPD'!W$2)=0,\"\",SUMIFS('07 PDR'!$F$4:$F$5600,'07 PDR'!$A$4:$A$5600,'05 CPD'!$A9,'07 PDR'!$L$4:$L$5600,'05 CPD'!W$2))","v":""},{"$f":"IF(SUMIFS('07 PDR'!$F$4:$F$5600,'07 PDR'!$A$4:$A$5600,'05 CPD'!$A9,'07 PDR'!$L$4:$L$5600,'05 CPD'!X$2)=0,\"\",SUMIFS('07 PDR'!$F$4:$F$5600,'07 PDR'!$A$4:$A$5600,'05 CPD'!$A9,'07 PDR'!$L$4:$L$5600,'05 CPD'!X$2))","v":""},{"$f":"IF(SUMIFS('07 PDR'!$F$4:$F$5600,'07 PDR'!$A$4:$A$5600,'05 CPD'!$A9,'07 PDR'!$L$4:$L$5600,'05 CPD'!Y$2)=0,\"\",SUMIFS('07 PDR'!$F$4:$F$5600,'07 PDR'!$A$4:$A$5600,'05 CPD'!$A9,'07 PDR'!$L$4:$L$5600,'05 CPD'!Y$2))","v":""},{"$f":"IF(SUMIFS('07 PDR'!$F$4:$F$5600,'07 PDR'!$A$4:$A$5600,'05 CPD'!$A9,'07 PDR'!$L$4:$L$5600,'05 CPD'!Z$2)=0,\"\",SUMIFS('07 PDR'!$F$4:$F$5600,'07 PDR'!$A$4:$A$5600,'05 CPD'!$A9,'07 PDR'!$L$4:$L$5600,'05 CPD'!Z$2))","v":""},{"$f":"IF(SUMIFS('07 PDR'!$F$4:$F$5600,'07 PDR'!$A$4:$A$5600,'05 CPD'!$A9,'07 PDR'!$L$4:$L$5600,'05 CPD'!AA$2)=0,\"\",SUMIFS('07 PDR'!$F$4:$F$5600,'07 PDR'!$A$4:$A$5600,'05 CPD'!$A9,'07 PDR'!$L$4:$L$5600,'05 CPD'!AA$2))","v":""},{"$f":"IF(SUMIFS('07 PDR'!$F$4:$F$5600,'07 PDR'!$A$4:$A$5600,'05 CPD'!$A9,'07 PDR'!$L$4:$L$5600,'05 CPD'!AB$2)=0,\"\",SUMIFS('07 PDR'!$F$4:$F$5600,'07 PDR'!$A$4:$A$5600,'05 CPD'!$A9,'07 PDR'!$L$4:$L$5600,'05 CPD'!AB$2))","v":""},{"$f":"IF(SUMIFS('07 PDR'!$F$4:$F$5600,'07 PDR'!$A$4:$A$5600,'05 CPD'!$A9,'07 PDR'!$L$4:$L$5600,'05 CPD'!AC$2)=0,\"\",SUMIFS('07 PDR'!$F$4:$F$5600,'07 PDR'!$A$4:$A$5600,'05 CPD'!$A9,'07 PDR'!$L$4:$L$5600,'05 CPD'!AC$2))","v":""},{"$f":"IF(SUMIFS('07 PDR'!$F$4:$F$5600,'07 PDR'!$A$4:$A$5600,'05 CPD'!$A9,'07 PDR'!$L$4:$L$5600,'05 CPD'!AD$2)=0,\"\",SUMIFS('07 PDR'!$F$4:$F$5600,'07 PDR'!$A$4:$A$5600,'05 CPD'!$A9,'07 PDR'!$L$4:$L$5600,'05 CPD'!AD$2))","v":""},{"$f":"IF(SUMIFS('07 PDR'!$F$4:$F$5600,'07 PDR'!$A$4:$A$5600,'05 CPD'!$A9,'07 PDR'!$L$4:$L$5600,'05 CPD'!AE$2)=0,\"\",SUMIFS('07 PDR'!$F$4:$F$5600,'07 PDR'!$A$4:$A$5600,'05 CPD'!$A9,'07 PDR'!$L$4:$L$5600,'05 CPD'!AE$2))","v":""},{"$f":"IF(SUMIFS('07 PDR'!$F$4:$F$5600,'07 PDR'!$A$4:$A$5600,'05 CPD'!$A9,'07 PDR'!$L$4:$L$5600,'05 CPD'!AF$2)=0,\"\",SUMIFS('07 PDR'!$F$4:$F$5600,'07 PDR'!$A$4:$A$5600,'05 CPD'!$A9,'07 PDR'!$L$4:$L$5600,'05 CPD'!AF$2))","v":""}]
["Jan 2015 - Aug 2015","","","",null,null,null,{"$f":"IF(SUMIFS('07 PDR'!$F$4:$F$5600,'07 PDR'!$A$4:$A$5600,'05 CPD'!$A10,'07 PDR'!$K$4:$K$5600,'05 CPD'!H$2)=0,\"\",SUMIFS('07 PDR'!$F$4:$F$5600,'07 PDR'!$A$4:$A$5600,'05 CPD'!$A10,'07 PDR'!$K$4:$K$5600,'05 CPD'!H$2))","v":""},{"$f":"IF(SUMIFS('07 PDR'!$F$4:$F$5600,'07 PDR'!$A$4:$A$5600,'05 CPD'!$A10,'07 PDR'!$K$4:$K$5600,'05 CPD'!I$2)=0,\"\",SUMIFS('07 PDR'!$F$4:$F$5600,'07 PDR'!$A$4:$A$5600,'05 CPD'!$A10,'07 PDR'!$K$4:$K$5600,'05 CPD'!I$2))","v":""},{"$f":"IF(SUMIFS('07 PDR'!$F$4:$F$5600,'07 PDR'!$A$4:$A$5600,'05 CPD'!$A10,'07 PDR'!$K$4:$K$5600,'05 CPD'!J$2)=0,\"\",SUMIFS('07 PDR'!$F$4:$F$5600,'07 PDR'!$A$4:$A$5600,'05 CPD'!$A10,'07 PDR'!$K$4:$K$5600,'05 CPD'!J$2))","v":""},{"$f":"IF(SUMIFS('07 PDR'!$F$4:$F$5600,'07 PDR'!$A$4:$A$5600,'05 CPD'!$A10,'07 PDR'!$K$4:$K$5600,'05 CPD'!K$2)=0,\"\",SUMIFS('07 PDR'!$F$4:$F$5600,'07 PDR'!$A$4:$A$5600,'05 CPD'!$A10,'07 PDR'!$K$4:$K$5600,'05 CPD'!K$2))","v":""},{"$f":"IF(SUMIFS('07 PDR'!$F$4:$F$5600,'07 PDR'!$A$4:$A$5600,'05 CPD'!$A10,'07 PDR'!$K$4:$K$5600,'05 CPD'!L$2)=0,\"\",SUMIFS('07 PDR'!$F$4:$F$5600,'07 PDR'!$A$4:$A$5600,'05 CPD'!$A10,'07 PDR'!$K$4:$K$5600,'05 CPD'!L$2))","v":""},{"$f":"IF(SUMIFS('07 PDR'!$F$4:$F$5600,'07 PDR'!$A$4:$A$5600,'05 CPD'!$A10,'07 PDR'!$K$4:$K$5600,'05 CPD'!M$2)=0,\"\",SUMIFS('07 PDR'!$F$4:$F$5600,'07 PDR'!$A$4:$A$5600,'05 CPD'!$A10,'07 PDR'!$K$4:$K$5600,'05 CPD'!M$2))","v":""},{"$f":"IF(SUMIFS('07 PDR'!$F$4:$F$5600,'07 PDR'!$A$4:$A$5600,'05 CPD'!$A10,'07 PDR'!$K$4:$K$5600,'05 CPD'!N$2)=0,\"\",SUMIFS('07 PDR'!$F$4:$F$5600,'07 PDR'!$A$4:$A$5600,'05 CPD'!$A10,'07 PDR'!$K$4:$K$5600,'05 CPD'!N$2))","v":""},{"$f":"IF(SUMIFS('07 PDR'!$F$4:$F$5600,'07 PDR'!$A$4:$A$5600,'05 CPD'!$A10,'07 PDR'!$K$4:$K$5600,'05 CPD'!O$2)=0,\"\",SUMIFS('07 PDR'!$F$4:$F$5600,'07 PDR'!$A$4:$A$5600,'05 CPD'!$A10,'07 PDR'!$K$4:$K$5600,'05 CPD'!O$2))","v":""},{"$f":"IF(SUMIFS('07 PDR'!$F$4:$F$5600,'07 PDR'!$A$4:$A$5600,'05 CPD'!$A10,'07 PDR'!$K$4:$K$5600,'05 CPD'!P$2)=0,\"\",SUMIFS('07 PDR'!$F$4:$F$5600,'07 PDR'!$A$4:$A$5600,'05 CPD'!$A10,'07 PDR'!$K$4:$K$5600,'05 CPD'!P$2))","v":""},{"$f":"IF(SUMIFS('07 PDR'!$F$4:$F$5600,'07 PDR'!$A$4:$A$5600,'05 CPD'!$A10,'07 PDR'!$K$4:$K$5600,'05 CPD'!Q$2)=0,\"\",SUMIFS('07 PDR'!$F$4:$F$5600,'07 PDR'!$A$4:$A$5600,'05 CPD'!$A10,'07 PDR'!$K$4:$K$5600,'05 CPD'!Q$2))","v":""},{"$f":"IF(SUMIFS('07 PDR'!$F$4:$F$5600,'07 PDR'!$A$4:$A$5600,'05 CPD'!$A10,'07 PDR'!$K$4:$K$5600,'05 CPD'!R$2)=0,\"\",SUMIFS('07 PDR'!$F$4:$F$5600,'07 PDR'!$A$4:$A$5600,'05 CPD'!$A10,'07 PDR'!$K$4:$K$5600,'05 CPD'!R$2))","v":""},null,{"$f":"IF(SUMIFS('07 PDR'!$F$4:$F$5600,'07 PDR'!$A$4:$A$5600,'05 CPD'!$A10,'07 PDR'!$L$4:$L$5600,'05 CPD'!T$2)=0,\"\",SUMIFS('07 PDR'!$F$4:$F$5600,'07 PDR'!$A$4:$A$5600,'05 CPD'!$A10,'07 PDR'!$L$4:$L$5600,'05 CPD'!T$2))","v":""},{"$f":"IF(SUMIFS('07 PDR'!$F$4:$F$5600,'07 PDR'!$A$4:$A$5600,'05 CPD'!$A10,'07 PDR'!$L$4:$L$5600,'05 CPD'!U$2)=0,\"\",SUMIFS('07 PDR'!$F$4:$F$5600,'07 PDR'!$A$4:$A$5600,'05 CPD'!$A10,'07 PDR'!$L$4:$L$5600,'05 CPD'!U$2))","v":""},{"$f":"IF(SUMIFS('07 PDR'!$F$4:$F$5600,'07 PDR'!$A$4:$A$5600,'05 CPD'!$A10,'07 PDR'!$L$4:$L$5600,'05 CPD'!V$2)=0,\"\",SUMIFS('07 PDR'!$F$4:$F$5600,'07 PDR'!$A$4:$A$5600,'05 CPD'!$A10,'07 PDR'!$L$4:$L$5600,'05 CPD'!V$2))","v":""},{"$f":"IF(SUMIFS('07 PDR'!$F$4:$F$5600,'07 PDR'!$A$4:$A$5600,'05 CPD'!$A10,'07 PDR'!$L$4:$L$5600,'05 CPD'!W$2)=0,\"\",SUMIFS('07 PDR'!$F$4:$F$5600,'07 PDR'!$A$4:$A$5600,'05 CPD'!$A10,'07 PDR'!$L$4:$L$5600,'05 CPD'!W$2))","v":""},{"$f":"IF(SUMIFS('07 PDR'!$F$4:$F$5600,'07 PDR'!$A$4:$A$5600,'05 CPD'!$A10,'07 PDR'!$L$4:$L$5600,'05 CPD'!X$2)=0,\"\",SUMIFS('07 PDR'!$F$4:$F$5600,'07 PDR'!$A$4:$A$5600,'05 CPD'!$A10,'07 PDR'!$L$4:$L$5600,'05 CPD'!X$2))","v":""},{"$f":"IF(SUMIFS('07 PDR'!$F$4:$F$5600,'07 PDR'!$A$4:$A$5600,'05 CPD'!$A10,'07 PDR'!$L$4:$L$5600,'05 CPD'!Y$2)=0,\"\",SUMIFS('07 PDR'!$F$4:$F$5600,'07 PDR'!$A$4:$A$5600,'05 CPD'!$A10,'07 PDR'!$L$4:$L$5600,'05 CPD'!Y$2))","v":""},{"$f":"IF(SUMIFS('07 PDR'!$F$4:$F$5600,'07 PDR'!$A$4:$A$5600,'05 CPD'!$A10,'07 PDR'!$L$4:$L$5600,'05 CPD'!Z$2)=0,\"\",SUMIFS('07 PDR'!$F$4:$F$5600,'07 PDR'!$A$4:$A$5600,'05 CPD'!$A10,'07 PDR'!$L$4:$L$5600,'05 CPD'!Z$2))","v":""},{"$f":"IF(SUMIFS('07 PDR'!$F$4:$F$5600,'07 PDR'!$A$4:$A$5600,'05 CPD'!$A10,'07 PDR'!$L$4:$L$5600,'05 CPD'!AA$2)=0,\"\",SUMIFS('07 PDR'!$F$4:$F$5600,'07 PDR'!$A$4:$A$5600,'05 CPD'!$A10,'07 PDR'!$L$4:$L$5600,'05 CPD'!AA$2))","v":""},{"$f":"IF(SUMIFS('07 PDR'!$F$4:$F$5600,'07 PDR'!$A$4:$A$5600,'05 CPD'!$A10,'07 PDR'!$L$4:$L$5600,'05 CPD'!AB$2)=0,\"\",SUMIFS('07 PDR'!$F$4:$F$5600,'07 PDR'!$A$4:$A$5600,'05 CPD'!$A10,'07 PDR'!$L$4:$L$5600,'05 CPD'!AB$2))","v":""},{"$f":"IF(SUMIFS('07 PDR'!$F$4:$F$5600,'07 PDR'!$A$4:$A$5600,'05 CPD'!$A10,'07 PDR'!$L$4:$L$5600,'05 CPD'!AC$2)=0,\"\",SUMIFS('07 PDR'!$F$4:$F$5600,'07 PDR'!$A$4:$A$5600,'05 CPD'!$A10,'07 PDR'!$L$4:$L$5600,'05 CPD'!AC$2))","v":""},{"$f":"IF(SUMIFS('07 PDR'!$F$4:$F$5600,'07 PDR'!$A$4:$A$5600,'05 CPD'!$A10,'07 PDR'!$L$4:$L$5600,'05 CPD'!AD$2)=0,\"\",SUMIFS('07 PDR'!$F$4:$F$5600,'07 PDR'!$A$4:$A$5600,'05 CPD'!$A10,'07 PDR'!$L$4:$L$5600,'05 CPD'!AD$2))","v":""},{"$f":"IF(SUMIFS('07 PDR'!$F$4:$F$5600,'07 PDR'!$A$4:$A$5600,'05 CPD'!$A10,'07 PDR'!$L$4:$L$5600,'05 CPD'!AE$2)=0,\"\",SUMIFS('07 PDR'!$F$4:$F$5600,'07 PDR'!$A$4:$A$5600,'05 CPD'!$A10,'07 PDR'!$L$4:$L$5600,'05 CPD'!AE$2))","v":""},{"$f":"IF(SUMIFS('07 PDR'!$F$4:$F$5600,'07 PDR'!$A$4:$A$5600,'05 CPD'!$A10,'07 PDR'!$L$4:$L$5600,'05 CPD'!AF$2)=0,\"\",SUMIFS('07 PDR'!$F$4:$F$5600,'07 PDR'!$A$4:$A$5600,'05 CPD'!$A10,'07 PDR'!$L$4:$L$5600,'05 CPD'!AF$2))","v":""}]
["Sept 2015 - Aug 2016","","","",null,null,null,{"$f":"IF(SUMIFS('07 PDR'!$F$4:$F$5600,'07 PDR'!$A$4:$A$5600,'05 CPD'!$A11,'07 PDR'!$K$4:$K$5600,'05 CPD'!H$2)=0,\"\",SUMIFS('07 PDR'!$F$4:$F$5600,'07 PDR'!$A$4:$A$5600,'05 CPD'!$A11,'07 PDR'!$K$4:$K$5600,'05 CPD'!H$2))","v":""},{"$f":"IF(SUMIFS('07 PDR'!$F$4:$F$5600,'07 PDR'!$A$4:$A$5600,'05 CPD'!$A11,'07 PDR'!$K$4:$K$5600,'05 CPD'!I$2)=0,\"\",SUMIFS('07 PDR'!$F$4:$F$5600,'07 PDR'!$A$4:$A$5600,'05 CPD'!$A11,'07 PDR'!$K$4:$K$5600,'05 CPD'!I$2))","v":""},{"$f":"IF(SUMIFS('07 PDR'!$F$4:$F$5600,'07 PDR'!$A$4:$A$5600,'05 CPD'!$A11,'07 PDR'!$K$4:$K$5600,'05 CPD'!J$2)=0,\"\",SUMIFS('07 PDR'!$F$4:$F$5600,'07 PDR'!$A$4:$A$5600,'05 CPD'!$A11,'07 PDR'!$K$4:$K$5600,'05 CPD'!J$2))","v":""},{"$f":"IF(SUMIFS('07 PDR'!$F$4:$F$5600,'07 PDR'!$A$4:$A$5600,'05 CPD'!$A11,'07 PDR'!$K$4:$K$5600,'05 CPD'!K$2)=0,\"\",SUMIFS('07 PDR'!$F$4:$F$5600,'07 PDR'!$A$4:$A$5600,'05 CPD'!$A11,'07 PDR'!$K$4:$K$5600,'05 CPD'!K$2))","v":""},{"$f":"IF(SUMIFS('07 PDR'!$F$4:$F$5600,'07 PDR'!$A$4:$A$5600,'05 CPD'!$A11,'07 PDR'!$K$4:$K$5600,'05 CPD'!L$2)=0,\"\",SUMIFS('07 PDR'!$F$4:$F$5600,'07 PDR'!$A$4:$A$5600,'05 CPD'!$A11,'07 PDR'!$K$4:$K$5600,'05 CPD'!L$2))","v":""},{"$f":"IF(SUMIFS('07 PDR'!$F$4:$F$5600,'07 PDR'!$A$4:$A$5600,'05 CPD'!$A11,'07 PDR'!$K$4:$K$5600,'05 CPD'!M$2)=0,\"\",SUMIFS('07 PDR'!$F$4:$F$5600,'07 PDR'!$A$4:$A$5600,'05 CPD'!$A11,'07 PDR'!$K$4:$K$5600,'05 CPD'!M$2))","v":""},{"$f":"IF(SUMIFS('07 PDR'!$F$4:$F$5600,'07 PDR'!$A$4:$A$5600,'05 CPD'!$A11,'07 PDR'!$K$4:$K$5600,'05 CPD'!N$2)=0,\"\",SUMIFS('07 PDR'!$F$4:$F$5600,'07 PDR'!$A$4:$A$5600,'05 CPD'!$A11,'07 PDR'!$K$4:$K$5600,'05 CPD'!N$2))","v":""},{"$f":"IF(SUMIFS('07 PDR'!$F$4:$F$5600,'07 PDR'!$A$4:$A$5600,'05 CPD'!$A11,'07 PDR'!$K$4:$K$5600,'05 CPD'!O$2)=0,\"\",SUMIFS('07 PDR'!$F$4:$F$5600,'07 PDR'!$A$4:$A$5600,'05 CPD'!$A11,'07 PDR'!$K$4:$K$5600,'05 CPD'!O$2))","v":""},{"$f":"IF(SUMIFS('07 PDR'!$F$4:$F$5600,'07 PDR'!$A$4:$A$5600,'05 CPD'!$A11,'07 PDR'!$K$4:$K$5600,'05 CPD'!P$2)=0,\"\",SUMIFS('07 PDR'!$F$4:$F$5600,'07 PDR'!$A$4:$A$5600,'05 CPD'!$A11,'07 PDR'!$K$4:$K$5600,'05 CPD'!P$2))","v":""},{"$f":"IF(SUMIFS('07 PDR'!$F$4:$F$5600,'07 PDR'!$A$4:$A$5600,'05 CPD'!$A11,'07 PDR'!$K$4:$K$5600,'05 CPD'!Q$2)=0,\"\",SUMIFS('07 PDR'!$F$4:$F$5600,'07 PDR'!$A$4:$A$5600,'05 CPD'!$A11,'07 PDR'!$K$4:$K$5600,'05 CPD'!Q$2))","v":""},{"$f":"IF(SUMIFS('07 PDR'!$F$4:$F$5600,'07 PDR'!$A$4:$A$5600,'05 CPD'!$A11,'07 PDR'!$K$4:$K$5600,'05 CPD'!R$2)=0,\"\",SUMIFS('07 PDR'!$F$4:$F$5600,'07 PDR'!$A$4:$A$5600,'05 CPD'!$A11,'07 PDR'!$K$4:$K$5600,'05 CPD'!R$2))","v":""},null,{"$f":"IF(SUMIFS('07 PDR'!$F$4:$F$5600,'07 PDR'!$A$4:$A$5600,'05 CPD'!$A11,'07 PDR'!$L$4:$L$5600,'05 CPD'!T$2)=0,\"\",SUMIFS('07 PDR'!$F$4:$F$5600,'07 PDR'!$A$4:$A$5600,'05 CPD'!$A11,'07 PDR'!$L$4:$L$5600,'05 CPD'!T$2))","v":""},{"$f":"IF(SUMIFS('07 PDR'!$F$4:$F$5600,'07 PDR'!$A$4:$A$5600,'05 CPD'!$A11,'07 PDR'!$L$4:$L$5600,'05 CPD'!U$2)=0,\"\",SUMIFS('07 PDR'!$F$4:$F$5600,'07 PDR'!$A$4:$A$5600,'05 CPD'!$A11,'07 PDR'!$L$4:$L$5600,'05 CPD'!U$2))","v":""},{"$f":"IF(SUMIFS('07 PDR'!$F$4:$F$5600,'07 PDR'!$A$4:$A$5600,'05 CPD'!$A11,'07 PDR'!$L$4:$L$5600,'05 CPD'!V$2)=0,\"\",SUMIFS('07 PDR'!$F$4:$F$5600,'07 PDR'!$A$4:$A$5600,'05 CPD'!$A11,'07 PDR'!$L$4:$L$5600,'05 CPD'!V$2))","v":""},{"$f":"IF(SUMIFS('07 PDR'!$F$4:$F$5600,'07 PDR'!$A$4:$A$5600,'05 CPD'!$A11,'07 PDR'!$L$4:$L$5600,'05 CPD'!W$2)=0,\"\",SUMIFS('07 PDR'!$F$4:$F$5600,'07 PDR'!$A$4:$A$5600,'05 CPD'!$A11,'07 PDR'!$L$4:$L$5600,'05 CPD'!W$2))","v":""},{"$f":"IF(SUMIFS('07 PDR'!$F$4:$F$5600,'07 PDR'!$A$4:$A$5600,'05 CPD'!$A11,'07 PDR'!$L$4:$L$5600,'05 CPD'!X$2)=0,\"\",SUMIFS('07 PDR'!$F$4:$F$5600,'07 PDR'!$A$4:$A$5600,'05 CPD'!$A11,'07 PDR'!$L$4:$L$5600,'05 CPD'!X$2))","v":""},{"$f":"IF(SUMIFS('07 PDR'!$F$4:$F$5600,'07 PDR'!$A$4:$A$5600,'05 CPD'!$A11,'07 PDR'!$L$4:$L$5600,'05 CPD'!Y$2)=0,\"\",SUMIFS('07 PDR'!$F$4:$F$5600,'07 PDR'!$A$4:$A$5600,'05 CPD'!$A11,'07 PDR'!$L$4:$L$5600,'05 CPD'!Y$2))","v":""},{"$f":"IF(SUMIFS('07 PDR'!$F$4:$F$5600,'07 PDR'!$A$4:$A$5600,'05 CPD'!$A11,'07 PDR'!$L$4:$L$5600,'05 CPD'!Z$2)=0,\"\",SUMIFS('07 PDR'!$F$4:$F$5600,'07 PDR'!$A$4:$A$5600,'05 CPD'!$A11,'07 PDR'!$L$4:$L$5600,'05 CPD'!Z$2))","v":""},{"$f":"IF(SUMIFS('07 PDR'!$F$4:$F$5600,'07 PDR'!$A$4:$A$5600,'05 CPD'!$A11,'07 PDR'!$L$4:$L$5600,'05 CPD'!AA$2)=0,\"\",SUMIFS('07 PDR'!$F$4:$F$5600,'07 PDR'!$A$4:$A$5600,'05 CPD'!$A11,'07 PDR'!$L$4:$L$5600,'05 CPD'!AA$2))","v":""},{"$f":"IF(SUMIFS('07 PDR'!$F$4:$F$5600,'07 PDR'!$A$4:$A$5600,'05 CPD'!$A11,'07 PDR'!$L$4:$L$5600,'05 CPD'!AB$2)=0,\"\",SUMIFS('07 PDR'!$F$4:$F$5600,'07 PDR'!$A$4:$A$5600,'05 CPD'!$A11,'07 PDR'!$L$4:$L$5600,'05 CPD'!AB$2))","v":""},{"$f":"IF(SUMIFS('07 PDR'!$F$4:$F$5600,'07 PDR'!$A$4:$A$5600,'05 CPD'!$A11,'07 PDR'!$L$4:$L$5600,'05 CPD'!AC$2)=0,\"\",SUMIFS('07 PDR'!$F$4:$F$5600,'07 PDR'!$A$4:$A$5600,'05 CPD'!$A11,'07 PDR'!$L$4:$L$5600,'05 CPD'!AC$2))","v":""},{"$f":"IF(SUMIFS('07 PDR'!$F$4:$F$5600,'07 PDR'!$A$4:$A$5600,'05 CPD'!$A11,'07 PDR'!$L$4:$L$5600,'05 CPD'!AD$2)=0,\"\",SUMIFS('07 PDR'!$F$4:$F$5600,'07 PDR'!$A$4:$A$5600,'05 CPD'!$A11,'07 PDR'!$L$4:$L$5600,'05 CPD'!AD$2))","v":""},{"$f":"IF(SUMIFS('07 PDR'!$F$4:$F$5600,'07 PDR'!$A$4:$A$5600,'05 CPD'!$A11,'07 PDR'!$L$4:$L$5600,'05 CPD'!AE$2)=0,\"\",SUMIFS('07 PDR'!$F$4:$F$5600,'07 PDR'!$A$4:$A$5600,'05 CPD'!$A11,'07 PDR'!$L$4:$L$5600,'05 CPD'!AE$2))","v":""},{"$f":"IF(SUMIFS('07 PDR'!$F$4:$F$5600,'07 PDR'!$A$4:$A$5600,'05 CPD'!$A11,'07 PDR'!$L$4:$L$5600,'05 CPD'!AF$2)=0,\"\",SUMIFS('07 PDR'!$F$4:$F$5600,'07 PDR'!$A$4:$A$5600,'05 CPD'!$A11,'07 PDR'!$L$4:$L$5600,'05 CPD'!AF$2))","v":""}]
["Sept 2016 - Aug 2017","","","",null,null,null,{"$f":"IF(SUMIFS('07 PDR'!$F$4:$F$5600,'07 PDR'!$A$4:$A$5600,'05 CPD'!$A12,'07 PDR'!$K$4:$K$5600,'05 CPD'!H$2)=0,\"\",SUMIFS('07 PDR'!$F$4:$F$5600,'07 PDR'!$A$4:$A$5600,'05 CPD'!$A12,'07 PDR'!$K$4:$K$5600,'05 CPD'!H$2))","v":""},{"$f":"IF(SUMIFS('07 PDR'!$F$4:$F$5600,'07 PDR'!$A$4:$A$5600,'05 CPD'!$A12,'07 PDR'!$K$4:$K$5600,'05 CPD'!I$2)=0,\"\",SUMIFS('07 PDR'!$F$4:$F$5600,'07 PDR'!$A$4:$A$5600,'05 CPD'!$A12,'07 PDR'!$K$4:$K$5600,'05 CPD'!I$2))","v":""},{"$f":"IF(SUMIFS('07 PDR'!$F$4:$F$5600,'07 PDR'!$A$4:$A$5600,'05 CPD'!$A12,'07 PDR'!$K$4:$K$5600,'05 CPD'!J$2)=0,\"\",SUMIFS('07 PDR'!$F$4:$F$5600,'07 PDR'!$A$4:$A$5600,'05 CPD'!$A12,'07 PDR'!$K$4:$K$5600,'05 CPD'!J$2))","v":""},{"$f":"IF(SUMIFS('07 PDR'!$F$4:$F$5600,'07 PDR'!$A$4:$A$5600,'05 CPD'!$A12,'07 PDR'!$K$4:$K$5600,'05 CPD'!K$2)=0,\"\",SUMIFS('07 PDR'!$F$4:$F$5600,'07 PDR'!$A$4:$A$5600,'05 CPD'!$A12,'07 PDR'!$K$4:$K$5600,'05 CPD'!K$2))","v":""},{"$f":"IF(SUMIFS('07 PDR'!$F$4:$F$5600,'07 PDR'!$A$4:$A$5600,'05 CPD'!$A12,'07 PDR'!$K$4:$K$5600,'05 CPD'!L$2)=0,\"\",SUMIFS('07 PDR'!$F$4:$F$5600,'07 PDR'!$A$4:$A$5600,'05 CPD'!$A12,'07 PDR'!$K$4:$K$5600,'05 CPD'!L$2))","v":""},{"$f":"IF(SUMIFS('07 PDR'!$F$4:$F$5600,'07 PDR'!$A$4:$A$5600,'05 CPD'!$A12,'07 PDR'!$K$4:$K$5600,'05 CPD'!M$2)=0,\"\",SUMIFS('07 PDR'!$F$4:$F$5600,'07 PDR'!$A$4:$A$5600,'05 CPD'!$A12,'07 PDR'!$K$4:$K$5600,'05 CPD'!M$2))","v":""},{"$f":"IF(SUMIFS('07 PDR'!$F$4:$F$5600,'07 PDR'!$A$4:$A$5600,'05 CPD'!$A12,'07 PDR'!$K$4:$K$5600,'05 CPD'!N$2)=0,\"\",SUMIFS('07 PDR'!$F$4:$F$5600,'07 PDR'!$A$4:$A$5600,'05 CPD'!$A12,'07 PDR'!$K$4:$K$5600,'05 CPD'!N$2))","v":""},{"$f":"IF(SUMIFS('07 PDR'!$F$4:$F$5600,'07 PDR'!$A$4:$A$5600,'05 CPD'!$A12,'07 PDR'!$K$4:$K$5600,'05 CPD'!O$2)=0,\"\",SUMIFS('07 PDR'!$F$4:$F$5600,'07 PDR'!$A$4:$A$5600,'05 CPD'!$A12,'07 PDR'!$K$4:$K$5600,'05 CPD'!O$2))","v":""},{"$f":"IF(SUMIFS('07 PDR'!$F$4:$F$5600,'07 PDR'!$A$4:$A$5600,'05 CPD'!$A12,'07 PDR'!$K$4:$K$5600,'05 CPD'!P$2)=0,\"\",SUMIFS('07 PDR'!$F$4:$F$5600,'07 PDR'!$A$4:$A$5600,'05 CPD'!$A12,'07 PDR'!$K$4:$K$5600,'05 CPD'!P$2))","v":""},{"$f":"IF(SUMIFS('07 PDR'!$F$4:$F$5600,'07 PDR'!$A$4:$A$5600,'05 CPD'!$A12,'07 PDR'!$K$4:$K$5600,'05 CPD'!Q$2)=0,\"\",SUMIFS('07 PDR'!$F$4:$F$5600,'07 PDR'!$A$4:$A$5600,'05 CPD'!$A12,'07 PDR'!$K$4:$K$5600,'05 CPD'!Q$2))","v":""},{"$f":"IF(SUMIFS('07 PDR'!$F$4:$F$5600,'07 PDR'!$A$4:$A$5600,'05 CPD'!$A12,'07 PDR'!$K$4:$K$5600,'05 CPD'!R$2)=0,\"\",SUMIFS('07 PDR'!$F$4:$F$5600,'07 PDR'!$A$4:$A$5600,'05 CPD'!$A12,'07 PDR'!$K$4:$K$5600,'05 CPD'!R$2))","v":""},null,{"$f":"IF(SUMIFS('07 PDR'!$F$4:$F$5600,'07 PDR'!$A$4:$A$5600,'05 CPD'!$A12,'07 PDR'!$L$4:$L$5600,'05 CPD'!T$2)=0,\"\",SUMIFS('07 PDR'!$F$4:$F$5600,'07 PDR'!$A$4:$A$5600,'05 CPD'!$A12,'07 PDR'!$L$4:$L$5600,'05 CPD'!T$2))","v":""},{"$f":"IF(SUMIFS('07 PDR'!$F$4:$F$5600,'07 PDR'!$A$4:$A$5600,'05 CPD'!$A12,'07 PDR'!$L$4:$L$5600,'05 CPD'!U$2)=0,\"\",SUMIFS('07 PDR'!$F$4:$F$5600,'07 PDR'!$A$4:$A$5600,'05 CPD'!$A12,'07 PDR'!$L$4:$L$5600,'05 CPD'!U$2))","v":""},{"$f":"IF(SUMIFS('07 PDR'!$F$4:$F$5600,'07 PDR'!$A$4:$A$5600,'05 CPD'!$A12,'07 PDR'!$L$4:$L$5600,'05 CPD'!V$2)=0,\"\",SUMIFS('07 PDR'!$F$4:$F$5600,'07 PDR'!$A$4:$A$5600,'05 CPD'!$A12,'07 PDR'!$L$4:$L$5600,'05 CPD'!V$2))","v":""},{"$f":"IF(SUMIFS('07 PDR'!$F$4:$F$5600,'07 PDR'!$A$4:$A$5600,'05 CPD'!$A12,'07 PDR'!$L$4:$L$5600,'05 CPD'!W$2)=0,\"\",SUMIFS('07 PDR'!$F$4:$F$5600,'07 PDR'!$A$4:$A$5600,'05 CPD'!$A12,'07 PDR'!$L$4:$L$5600,'05 CPD'!W$2))","v":""},{"$f":"IF(SUMIFS('07 PDR'!$F$4:$F$5600,'07 PDR'!$A$4:$A$5600,'05 CPD'!$A12,'07 PDR'!$L$4:$L$5600,'05 CPD'!X$2)=0,\"\",SUMIFS('07 PDR'!$F$4:$F$5600,'07 PDR'!$A$4:$A$5600,'05 CPD'!$A12,'07 PDR'!$L$4:$L$5600,'05 CPD'!X$2))","v":""},{"$f":"IF(SUMIFS('07 PDR'!$F$4:$F$5600,'07 PDR'!$A$4:$A$5600,'05 CPD'!$A12,'07 PDR'!$L$4:$L$5600,'05 CPD'!Y$2)=0,\"\",SUMIFS('07 PDR'!$F$4:$F$5600,'07 PDR'!$A$4:$A$5600,'05 CPD'!$A12,'07 PDR'!$L$4:$L$5600,'05 CPD'!Y$2))","v":""},{"$f":"IF(SUMIFS('07 PDR'!$F$4:$F$5600,'07 PDR'!$A$4:$A$5600,'05 CPD'!$A12,'07 PDR'!$L$4:$L$5600,'05 CPD'!Z$2)=0,\"\",SUMIFS('07 PDR'!$F$4:$F$5600,'07 PDR'!$A$4:$A$5600,'05 CPD'!$A12,'07 PDR'!$L$4:$L$5600,'05 CPD'!Z$2))","v":""},{"$f":"IF(SUMIFS('07 PDR'!$F$4:$F$5600,'07 PDR'!$A$4:$A$5600,'05 CPD'!$A12,'07 PDR'!$L$4:$L$5600,'05 CPD'!AA$2)=0,\"\",SUMIFS('07 PDR'!$F$4:$F$5600,'07 PDR'!$A$4:$A$5600,'05 CPD'!$A12,'07 PDR'!$L$4:$L$5600,'05 CPD'!AA$2))","v":""},{"$f":"IF(SUMIFS('07 PDR'!$F$4:$F$5600,'07 PDR'!$A$4:$A$5600,'05 CPD'!$A12,'07 PDR'!$L$4:$L$5600,'05 CPD'!AB$2)=0,\"\",SUMIFS('07 PDR'!$F$4:$F$5600,'07 PDR'!$A$4:$A$5600,'05 CPD'!$A12,'07 PDR'!$L$4:$L$5600,'05 CPD'!AB$2))","v":""},{"$f":"IF(SUMIFS('07 PDR'!$F$4:$F$5600,'07 PDR'!$A$4:$A$5600,'05 CPD'!$A12,'07 PDR'!$L$4:$L$5600,'05 CPD'!AC$2)=0,\"\",SUMIFS('07 PDR'!$F$4:$F$5600,'07 PDR'!$A$4:$A$5600,'05 CPD'!$A12,'07 PDR'!$L$4:$L$5600,'05 CPD'!AC$2))","v":""},{"$f":"IF(SUMIFS('07 PDR'!$F$4:$F$5600,'07 PDR'!$A$4:$A$5600,'05 CPD'!$A12,'07 PDR'!$L$4:$L$5600,'05 CPD'!AD$2)=0,\"\",SUMIFS('07 PDR'!$F$4:$F$5600,'07 PDR'!$A$4:$A$5600,'05 CPD'!$A12,'07 PDR'!$L$4:$L$5600,'05 CPD'!AD$2))","v":""},{"$f":"IF(SUMIFS('07 PDR'!$F$4:$F$5600,'07 PDR'!$A$4:$A$5600,'05 CPD'!$A12,'07 PDR'!$L$4:$L$5600,'05 CPD'!AE$2)=0,\"\",SUMIFS('07 PDR'!$F$4:$F$5600,'07 PDR'!$A$4:$A$5600,'05 CPD'!$A12,'07 PDR'!$L$4:$L$5600,'05 CPD'!AE$2))","v":""},{"$f":"IF(SUMIFS('07 PDR'!$F$4:$F$5600,'07 PDR'!$A$4:$A$5600,'05 CPD'!$A12,'07 PDR'!$L$4:$L$5600,'05 CPD'!AF$2)=0,\"\",SUMIFS('07 PDR'!$F$4:$F$5600,'07 PDR'!$A$4:$A$5600,'05 CPD'!$A12,'07 PDR'!$L$4:$L$5600,'05 CPD'!AF$2))","v":""}]
["Sept 2017 - Aug 2018","","","",null,null,null,{"$f":"IF(SUMIFS('07 PDR'!$F$4:$F$5600,'07 PDR'!$A$4:$A$5600,'05 CPD'!$A13,'07 PDR'!$K$4:$K$5600,'05 CPD'!H$2)=0,\"\",SUMIFS('07 PDR'!$F$4:$F$5600,'07 PDR'!$A$4:$A$5600,'05 CPD'!$A13,'07 PDR'!$K$4:$K$5600,'05 CPD'!H$2))","v":""},{"$f":"IF(SUMIFS('07 PDR'!$F$4:$F$5600,'07 PDR'!$A$4:$A$5600,'05 CPD'!$A13,'07 PDR'!$K$4:$K$5600,'05 CPD'!I$2)=0,\"\",SUMIFS('07 PDR'!$F$4:$F$5600,'07 PDR'!$A$4:$A$5600,'05 CPD'!$A13,'07 PDR'!$K$4:$K$5600,'05 CPD'!I$2))","v":""},{"$f":"IF(SUMIFS('07 PDR'!$F$4:$F$5600,'07 PDR'!$A$4:$A$5600,'05 CPD'!$A13,'07 PDR'!$K$4:$K$5600,'05 CPD'!J$2)=0,\"\",SUMIFS('07 PDR'!$F$4:$F$5600,'07 PDR'!$A$4:$A$5600,'05 CPD'!$A13,'07 PDR'!$K$4:$K$5600,'05 CPD'!J$2))","v":""},{"$f":"IF(SUMIFS('07 PDR'!$F$4:$F$5600,'07 PDR'!$A$4:$A$5600,'05 CPD'!$A13,'07 PDR'!$K$4:$K$5600,'05 CPD'!K$2)=0,\"\",SUMIFS('07 PDR'!$F$4:$F$5600,'07 PDR'!$A$4:$A$5600,'05 CPD'!$A13,'07 PDR'!$K$4:$K$5600,'05 CPD'!K$2))","v":""},{"$f":"IF(SUMIFS('07 PDR'!$F$4:$F$5600,'07 PDR'!$A$4:$A$5600,'05 CPD'!$A13,'07 PDR'!$K$4:$K$5600,'05 CPD'!L$2)=0,\"\",SUMIFS('07 PDR'!$F$4:$F$5600,'07 PDR'!$A$4:$A$5600,'05 CPD'!$A13,'07 PDR'!$K$4:$K$5600,'05 CPD'!L$2))","v":""},{"$f":"IF(SUMIFS('07 PDR'!$F$4:$F$5600,'07 PDR'!$A$4:$A$5600,'05 CPD'!$A13,'07 PDR'!$K$4:$K$5600,'05 CPD'!M$2)=0,\"\",SUMIFS('07 PDR'!$F$4:$F$5600,'07 PDR'!$A$4:$A$5600,'05 CPD'!$A13,'07 PDR'!$K$4:$K$5600,'05 CPD'!M$2))","v":""},{"$f":"IF(SUMIFS('07 PDR'!$F$4:$F$5600,'07 PDR'!$A$4:$A$5600,'05 CPD'!$A13,'07 PDR'!$K$4:$K$5600,'05 CPD'!N$2)=0,\"\",SUMIFS('07 PDR'!$F$4:$F$5600,'07 PDR'!$A$4:$A$5600,'05 CPD'!$A13,'07 PDR'!$K$4:$K$5600,'05 CPD'!N$2))","v":""},{"$f":"IF(SUMIFS('07 PDR'!$F$4:$F$5600,'07 PDR'!$A$4:$A$5600,'05 CPD'!$A13,'07 PDR'!$K$4:$K$5600,'05 CPD'!O$2)=0,\"\",SUMIFS('07 PDR'!$F$4:$F$5600,'07 PDR'!$A$4:$A$5600,'05 CPD'!$A13,'07 PDR'!$K$4:$K$5600,'05 CPD'!O$2))","v":""},{"$f":"IF(SUMIFS('07 PDR'!$F$4:$F$5600,'07 PDR'!$A$4:$A$5600,'05 CPD'!$A13,'07 PDR'!$K$4:$K$5600,'05 CPD'!P$2)=0,\"\",SUMIFS('07 PDR'!$F$4:$F$5600,'07 PDR'!$A$4:$A$5600,'05 CPD'!$A13,'07 PDR'!$K$4:$K$5600,'05 CPD'!P$2))","v":""},{"$f":"IF(SUMIFS('07 PDR'!$F$4:$F$5600,'07 PDR'!$A$4:$A$5600,'05 CPD'!$A13,'07 PDR'!$K$4:$K$5600,'05 CPD'!Q$2)=0,\"\",SUMIFS('07 PDR'!$F$4:$F$5600,'07 PDR'!$A$4:$A$5600,'05 CPD'!$A13,'07 PDR'!$K$4:$K$5600,'05 CPD'!Q$2))","v":""},{"$f":"IF(SUMIFS('07 PDR'!$F$4:$F$5600,'07 PDR'!$A$4:$A$5600,'05 CPD'!$A13,'07 PDR'!$K$4:$K$5600,'05 CPD'!R$2)=0,\"\",SUMIFS('07 PDR'!$F$4:$F$5600,'07 PDR'!$A$4:$A$5600,'05 CPD'!$A13,'07 PDR'!$K$4:$K$5600,'05 CPD'!R$2))","v":""},null,{"$f":"IF(SUMIFS('07 PDR'!$F$4:$F$5600,'07 PDR'!$A$4:$A$5600,'05 CPD'!$A13,'07 PDR'!$L$4:$L$5600,'05 CPD'!T$2)=0,\"\",SUMIFS('07 PDR'!$F$4:$F$5600,'07 PDR'!$A$4:$A$5600,'05 CPD'!$A13,'07 PDR'!$L$4:$L$5600,'05 CPD'!T$2))","v":""},{"$f":"IF(SUMIFS('07 PDR'!$F$4:$F$5600,'07 PDR'!$A$4:$A$5600,'05 CPD'!$A13,'07 PDR'!$L$4:$L$5600,'05 CPD'!U$2)=0,\"\",SUMIFS('07 PDR'!$F$4:$F$5600,'07 PDR'!$A$4:$A$5600,'05 CPD'!$A13,'07 PDR'!$L$4:$L$5600,'05 CPD'!U$2))","v":""},{"$f":"IF(SUMIFS('07 PDR'!$F$4:$F$5600,'07 PDR'!$A$4:$A$5600,'05 CPD'!$A13,'07 PDR'!$L$4:$L$5600,'05 CPD'!V$2)=0,\"\",SUMIFS('07 PDR'!$F$4:$F$5600,'07 PDR'!$A$4:$A$5600,'05 CPD'!$A13,'07 PDR'!$L$4:$L$5600,'05 CPD'!V$2))","v":""},{"$f":"IF(SUMIFS('07 PDR'!$F$4:$F$5600,'07 PDR'!$A$4:$A$5600,'05 CPD'!$A13,'07 PDR'!$L$4:$L$5600,'05 CPD'!W$2)=0,\"\",SUMIFS('07 PDR'!$F$4:$F$5600,'07 PDR'!$A$4:$A$5600,'05 CPD'!$A13,'07 PDR'!$L$4:$L$5600,'05 CPD'!W$2))","v":""},{"$f":"IF(SUMIFS('07 PDR'!$F$4:$F$5600,'07 PDR'!$A$4:$A$5600,'05 CPD'!$A13,'07 PDR'!$L$4:$L$5600,'05 CPD'!X$2)=0,\"\",SUMIFS('07 PDR'!$F$4:$F$5600,'07 PDR'!$A$4:$A$5600,'05 CPD'!$A13,'07 PDR'!$L$4:$L$5600,'05 CPD'!X$2))","v":""},{"$f":"IF(SUMIFS('07 PDR'!$F$4:$F$5600,'07 PDR'!$A$4:$A$5600,'05 CPD'!$A13,'07 PDR'!$L$4:$L$5600,'05 CPD'!Y$2)=0,\"\",SUMIFS('07 PDR'!$F$4:$F$5600,'07 PDR'!$A$4:$A$5600,'05 CPD'!$A13,'07 PDR'!$L$4:$L$5600,'05 CPD'!Y$2))","v":""},{"$f":"IF(SUMIFS('07 PDR'!$F$4:$F$5600,'07 PDR'!$A$4:$A$5600,'05 CPD'!$A13,'07 PDR'!$L$4:$L$5600,'05 CPD'!Z$2)=0,\"\",SUMIFS('07 PDR'!$F$4:$F$5600,'07 PDR'!$A$4:$A$5600,'05 CPD'!$A13,'07 PDR'!$L$4:$L$5600,'05 CPD'!Z$2))","v":""},{"$f":"IF(SUMIFS('07 PDR'!$F$4:$F$5600,'07 PDR'!$A$4:$A$5600,'05 CPD'!$A13,'07 PDR'!$L$4:$L$5600,'05 CPD'!AA$2)=0,\"\",SUMIFS('07 PDR'!$F$4:$F$5600,'07 PDR'!$A$4:$A$5600,'05 CPD'!$A13,'07 PDR'!$L$4:$L$5600,'05 CPD'!AA$2))","v":""},{"$f":"IF(SUMIFS('07 PDR'!$F$4:$F$5600,'07 PDR'!$A$4:$A$5600,'05 CPD'!$A13,'07 PDR'!$L$4:$L$5600,'05 CPD'!AB$2)=0,\"\",SUMIFS('07 PDR'!$F$4:$F$5600,'07 PDR'!$A$4:$A$5600,'05 CPD'!$A13,'07 PDR'!$L$4:$L$5600,'05 CPD'!AB$2))","v":""},{"$f":"IF(SUMIFS('07 PDR'!$F$4:$F$5600,'07 PDR'!$A$4:$A$5600,'05 CPD'!$A13,'07 PDR'!$L$4:$L$5600,'05 CPD'!AC$2)=0,\"\",SUMIFS('07 PDR'!$F$4:$F$5600,'07 PDR'!$A$4:$A$5600,'05 CPD'!$A13,'07 PDR'!$L$4:$L$5600,'05 CPD'!AC$2))","v":""},{"$f":"IF(SUMIFS('07 PDR'!$F$4:$F$5600,'07 PDR'!$A$4:$A$5600,'05 CPD'!$A13,'07 PDR'!$L$4:$L$5600,'05 CPD'!AD$2)=0,\"\",SUMIFS('07 PDR'!$F$4:$F$5600,'07 PDR'!$A$4:$A$5600,'05 CPD'!$A13,'07 PDR'!$L$4:$L$5600,'05 CPD'!AD$2))","v":""},{"$f":"IF(SUMIFS('07 PDR'!$F$4:$F$5600,'07 PDR'!$A$4:$A$5600,'05 CPD'!$A13,'07 PDR'!$L$4:$L$5600,'05 CPD'!AE$2)=0,\"\",SUMIFS('07 PDR'!$F$4:$F$5600,'07 PDR'!$A$4:$A$5600,'05 CPD'!$A13,'07 PDR'!$L$4:$L$5600,'05 CPD'!AE$2))","v":""},{"$f":"IF(SUMIFS('07 PDR'!$F$4:$F$5600,'07 PDR'!$A$4:$A$5600,'05 CPD'!$A13,'07 PDR'!$L$4:$L$5600,'05 CPD'!AF$2)=0,\"\",SUMIFS('07 PDR'!$F$4:$F$5600,'07 PDR'!$A$4:$A$5600,'05 CPD'!$A13,'07 PDR'!$L$4:$L$5600,'05 CPD'!AF$2))","v":""}]
["Sept 2018 - Aug 2019","","","",null,null,null,{"$f":"IF(SUMIFS('07 PDR'!$F$4:$F$5600,'07 PDR'!$A$4:$A$5600,'05 CPD'!$A14,'07 PDR'!$K$4:$K$5600,'05 CPD'!H$2)=0,\"\",SUMIFS('07 PDR'!$F$4:$F$5600,'07 PDR'!$A$4:$A$5600,'05 CPD'!$A14,'07 PDR'!$K$4:$K$5600,'05 CPD'!H$2))","v":""},{"$f":"IF(SUMIFS('07 PDR'!$F$4:$F$5600,'07 PDR'!$A$4:$A$5600,'05 CPD'!$A14,'07 PDR'!$K$4:$K$5600,'05 CPD'!I$2)=0,\"\",SUMIFS('07 PDR'!$F$4:$F$5600,'07 PDR'!$A$4:$A$5600,'05 CPD'!$A14,'07 PDR'!$K$4:$K$5600,'05 CPD'!I$2))","v":""},{"$f":"IF(SUMIFS('07 PDR'!$F$4:$F$5600,'07 PDR'!$A$4:$A$5600,'05 CPD'!$A14,'07 PDR'!$K$4:$K$5600,'05 CPD'!J$2)=0,\"\",SUMIFS('07 PDR'!$F$4:$F$5600,'07 PDR'!$A$4:$A$5600,'05 CPD'!$A14,'07 PDR'!$K$4:$K$5600,'05 CPD'!J$2))","v":""},{"$f":"IF(SUMIFS('07 PDR'!$F$4:$F$5600,'07 PDR'!$A$4:$A$5600,'05 CPD'!$A14,'07 PDR'!$K$4:$K$5600,'05 CPD'!K$2)=0,\"\",SUMIFS('07 PDR'!$F$4:$F$5600,'07 PDR'!$A$4:$A$5600,'05 CPD'!$A14,'07 PDR'!$K$4:$K$5600,'05 CPD'!K$2))","v":""},{"$f":"IF(SUMIFS('07 PDR'!$F$4:$F$5600,'07 PDR'!$A$4:$A$5600,'05 CPD'!$A14,'07 PDR'!$K$4:$K$5600,'05 CPD'!L$2)=0,\"\",SUMIFS('07 PDR'!$F$4:$F$5600,'07 PDR'!$A$4:$A$5600,'05 CPD'!$A14,'07 PDR'!$K$4:$K$5600,'05 CPD'!L$2))","v":""},{"$f":"IF(SUMIFS('07 PDR'!$F$4:$F$5600,'07 PDR'!$A$4:$A$5600,'05 CPD'!$A14,'07 PDR'!$K$4:$K$5600,'05 CPD'!M$2)=0,\"\",SUMIFS('07 PDR'!$F$4:$F$5600,'07 PDR'!$A$4:$A$5600,'05 CPD'!$A14,'07 PDR'!$K$4:$K$5600,'05 CPD'!M$2))","v":""},{"$f":"IF(SUMIFS('07 PDR'!$F$4:$F$5600,'07 PDR'!$A$4:$A$5600,'05 CPD'!$A14,'07 PDR'!$K$4:$K$5600,'05 CPD'!N$2)=0,\"\",SUMIFS('07 PDR'!$F$4:$F$5600,'07 PDR'!$A$4:$A$5600,'05 CPD'!$A14,'07 PDR'!$K$4:$K$5600,'05 CPD'!N$2))","v":""},{"$f":"IF(SUMIFS('07 PDR'!$F$4:$F$5600,'07 PDR'!$A$4:$A$5600,'05 CPD'!$A14,'07 PDR'!$K$4:$K$5600,'05 CPD'!O$2)=0,\"\",SUMIFS('07 PDR'!$F$4:$F$5600,'07 PDR'!$A$4:$A$5600,'05 CPD'!$A14,'07 PDR'!$K$4:$K$5600,'05 CPD'!O$2))","v":""},{"$f":"IF(SUMIFS('07 PDR'!$F$4:$F$5600,'07 PDR'!$A$4:$A$5600,'05 CPD'!$A14,'07 PDR'!$K$4:$K$5600,'05 CPD'!P$2)=0,\"\",SUMIFS('07 PDR'!$F$4:$F$5600,'07 PDR'!$A$4:$A$5600,'05 CPD'!$A14,'07 PDR'!$K$4:$K$5600,'05 CPD'!P$2))","v":""},{"$f":"IF(SUMIFS('07 PDR'!$F$4:$F$5600,'07 PDR'!$A$4:$A$5600,'05 CPD'!$A14,'07 PDR'!$K$4:$K$5600,'05 CPD'!Q$2)=0,\"\",SUMIFS('07 PDR'!$F$4:$F$5600,'07 PDR'!$A$4:$A$5600,'05 CPD'!$A14,'07 PDR'!$K$4:$K$5600,'05 CPD'!Q$2))","v":""},{"$f":"IF(SUMIFS('07 PDR'!$F$4:$F$5600,'07 PDR'!$A$4:$A$5600,'05 CPD'!$A14,'07 PDR'!$K$4:$K$5600,'05 CPD'!R$2)=0,\"\",SUMIFS('07 PDR'!$F$4:$F$5600,'07 PDR'!$A$4:$A$5600,'05 CPD'!$A14,'07 PDR'!$K$4:$K$5600,'05 CPD'!R$2))","v":""},null,{"$f":"IF(SUMIFS('07 PDR'!$F$4:$F$5600,'07 PDR'!$A$4:$A$5600,'05 CPD'!$A14,'07 PDR'!$L$4:$L$5600,'05 CPD'!T$2)=0,\"\",SUMIFS('07 PDR'!$F$4:$F$5600,'07 PDR'!$A$4:$A$5600,'05 CPD'!$A14,'07 PDR'!$L$4:$L$5600,'05 CPD'!T$2))","v":""},{"$f":"IF(SUMIFS('07 PDR'!$F$4:$F$5600,'07 PDR'!$A$4:$A$5600,'05 CPD'!$A14,'07 PDR'!$L$4:$L$5600,'05 CPD'!U$2)=0,\"\",SUMIFS('07 PDR'!$F$4:$F$5600,'07 PDR'!$A$4:$A$5600,'05 CPD'!$A14,'07 PDR'!$L$4:$L$5600,'05 CPD'!U$2))","v":""},{"$f":"IF(SUMIFS('07 PDR'!$F$4:$F$5600,'07 PDR'!$A$4:$A$5600,'05 CPD'!$A14,'07 PDR'!$L$4:$L$5600,'05 CPD'!V$2)=0,\"\",SUMIFS('07 PDR'!$F$4:$F$5600,'07 PDR'!$A$4:$A$5600,'05 CPD'!$A14,'07 PDR'!$L$4:$L$5600,'05 CPD'!V$2))","v":""},{"$f":"IF(SUMIFS('07 PDR'!$F$4:$F$5600,'07 PDR'!$A$4:$A$5600,'05 CPD'!$A14,'07 PDR'!$L$4:$L$5600,'05 CPD'!W$2)=0,\"\",SUMIFS('07 PDR'!$F$4:$F$5600,'07 PDR'!$A$4:$A$5600,'05 CPD'!$A14,'07 PDR'!$L$4:$L$5600,'05 CPD'!W$2))","v":""},{"$f":"IF(SUMIFS('07 PDR'!$F$4:$F$5600,'07 PDR'!$A$4:$A$5600,'05 CPD'!$A14,'07 PDR'!$L$4:$L$5600,'05 CPD'!X$2)=0,\"\",SUMIFS('07 PDR'!$F$4:$F$5600,'07 PDR'!$A$4:$A$5600,'05 CPD'!$A14,'07 PDR'!$L$4:$L$5600,'05 CPD'!X$2))","v":""},{"$f":"IF(SUMIFS('07 PDR'!$F$4:$F$5600,'07 PDR'!$A$4:$A$5600,'05 CPD'!$A14,'07 PDR'!$L$4:$L$5600,'05 CPD'!Y$2)=0,\"\",SUMIFS('07 PDR'!$F$4:$F$5600,'07 PDR'!$A$4:$A$5600,'05 CPD'!$A14,'07 PDR'!$L$4:$L$5600,'05 CPD'!Y$2))","v":""},{"$f":"IF(SUMIFS('07 PDR'!$F$4:$F$5600,'07 PDR'!$A$4:$A$5600,'05 CPD'!$A14,'07 PDR'!$L$4:$L$5600,'05 CPD'!Z$2)=0,\"\",SUMIFS('07 PDR'!$F$4:$F$5600,'07 PDR'!$A$4:$A$5600,'05 CPD'!$A14,'07 PDR'!$L$4:$L$5600,'05 CPD'!Z$2))","v":""},{"$f":"IF(SUMIFS('07 PDR'!$F$4:$F$5600,'07 PDR'!$A$4:$A$5600,'05 CPD'!$A14,'07 PDR'!$L$4:$L$5600,'05 CPD'!AA$2)=0,\"\",SUMIFS('07 PDR'!$F$4:$F$5600,'07 PDR'!$A$4:$A$5600,'05 CPD'!$A14,'07 PDR'!$L$4:$L$5600,'05 CPD'!AA$2))","v":""},{"$f":"IF(SUMIFS('07 PDR'!$F$4:$F$5600,'07 PDR'!$A$4:$A$5600,'05 CPD'!$A14,'07 PDR'!$L$4:$L$5600,'05 CPD'!AB$2)=0,\"\",SUMIFS('07 PDR'!$F$4:$F$5600,'07 PDR'!$A$4:$A$5600,'05 CPD'!$A14,'07 PDR'!$L$4:$L$5600,'05 CPD'!AB$2))","v":""},{"$f":"IF(SUMIFS('07 PDR'!$F$4:$F$5600,'07 PDR'!$A$4:$A$5600,'05 CPD'!$A14,'07 PDR'!$L$4:$L$5600,'05 CPD'!AC$2)=0,\"\",SUMIFS('07 PDR'!$F$4:$F$5600,'07 PDR'!$A$4:$A$5600,'05 CPD'!$A14,'07 PDR'!$L$4:$L$5600,'05 CPD'!AC$2))","v":""},{"$f":"IF(SUMIFS('07 PDR'!$F$4:$F$5600,'07 PDR'!$A$4:$A$5600,'05 CPD'!$A14,'07 PDR'!$L$4:$L$5600,'05 CPD'!AD$2)=0,\"\",SUMIFS('07 PDR'!$F$4:$F$5600,'07 PDR'!$A$4:$A$5600,'05 CPD'!$A14,'07 PDR'!$L$4:$L$5600,'05 CPD'!AD$2))","v":""},{"$f":"IF(SUMIFS('07 PDR'!$F$4:$F$5600,'07 PDR'!$A$4:$A$5600,'05 CPD'!$A14,'07 PDR'!$L$4:$L$5600,'05 CPD'!AE$2)=0,\"\",SUMIFS('07 PDR'!$F$4:$F$5600,'07 PDR'!$A$4:$A$5600,'05 CPD'!$A14,'07 PDR'!$L$4:$L$5600,'05 CPD'!AE$2))","v":""},{"$f":"IF(SUMIFS('07 PDR'!$F$4:$F$5600,'07 PDR'!$A$4:$A$5600,'05 CPD'!$A14,'07 PDR'!$L$4:$L$5600,'05 CPD'!AF$2)=0,\"\",SUMIFS('07 PDR'!$F$4:$F$5600,'07 PDR'!$A$4:$A$5600,'05 CPD'!$A14,'07 PDR'!$L$4:$L$5600,'05 CPD'!AF$2))","v":""}]
["Sept 2019 - Aug 2020","","","",null,null,null,{"$f":"IF(SUMIFS('07 PDR'!$F$4:$F$5600,'07 PDR'!$A$4:$A$5600,'05 CPD'!$A15,'07 PDR'!$K$4:$K$5600,'05 CPD'!H$2)=0,\"\",SUMIFS('07 PDR'!$F$4:$F$5600,'07 PDR'!$A$4:$A$5600,'05 CPD'!$A15,'07 PDR'!$K$4:$K$5600,'05 CPD'!H$2))","v":""},{"$f":"IF(SUMIFS('07 PDR'!$F$4:$F$5600,'07 PDR'!$A$4:$A$5600,'05 CPD'!$A15,'07 PDR'!$K$4:$K$5600,'05 CPD'!I$2)=0,\"\",SUMIFS('07 PDR'!$F$4:$F$5600,'07 PDR'!$A$4:$A$5600,'05 CPD'!$A15,'07 PDR'!$K$4:$K$5600,'05 CPD'!I$2))","v":""},{"$f":"IF(SUMIFS('07 PDR'!$F$4:$F$5600,'07 PDR'!$A$4:$A$5600,'05 CPD'!$A15,'07 PDR'!$K$4:$K$5600,'05 CPD'!J$2)=0,\"\",SUMIFS('07 PDR'!$F$4:$F$5600,'07 PDR'!$A$4:$A$5600,'05 CPD'!$A15,'07 PDR'!$K$4:$K$5600,'05 CPD'!J$2))","v":""},{"$f":"IF(SUMIFS('07 PDR'!$F$4:$F$5600,'07 PDR'!$A$4:$A$5600,'05 CPD'!$A15,'07 PDR'!$K$4:$K$5600,'05 CPD'!K$2)=0,\"\",SUMIFS('07 PDR'!$F$4:$F$5600,'07 PDR'!$A$4:$A$5600,'05 CPD'!$A15,'07 PDR'!$K$4:$K$5600,'05 CPD'!K$2))","v":""},{"$f":"IF(SUMIFS('07 PDR'!$F$4:$F$5600,'07 PDR'!$A$4:$A$5600,'05 CPD'!$A15,'07 PDR'!$K$4:$K$5600,'05 CPD'!L$2)=0,\"\",SUMIFS('07 PDR'!$F$4:$F$5600,'07 PDR'!$A$4:$A$5600,'05 CPD'!$A15,'07 PDR'!$K$4:$K$5600,'05 CPD'!L$2))","v":""},{"$f":"IF(SUMIFS('07 PDR'!$F$4:$F$5600,'07 PDR'!$A$4:$A$5600,'05 CPD'!$A15,'07 PDR'!$K$4:$K$5600,'05 CPD'!M$2)=0,\"\",SUMIFS('07 PDR'!$F$4:$F$5600,'07 PDR'!$A$4:$A$5600,'05 CPD'!$A15,'07 PDR'!$K$4:$K$5600,'05 CPD'!M$2))","v":""},{"$f":"IF(SUMIFS('07 PDR'!$F$4:$F$5600,'07 PDR'!$A$4:$A$5600,'05 CPD'!$A15,'07 PDR'!$K$4:$K$5600,'05 CPD'!N$2)=0,\"\",SUMIFS('07 PDR'!$F$4:$F$5600,'07 PDR'!$A$4:$A$5600,'05 CPD'!$A15,'07 PDR'!$K$4:$K$5600,'05 CPD'!N$2))","v":""},{"$f":"IF(SUMIFS('07 PDR'!$F$4:$F$5600,'07 PDR'!$A$4:$A$5600,'05 CPD'!$A15,'07 PDR'!$K$4:$K$5600,'05 CPD'!O$2)=0,\"\",SUMIFS('07 PDR'!$F$4:$F$5600,'07 PDR'!$A$4:$A$5600,'05 CPD'!$A15,'07 PDR'!$K$4:$K$5600,'05 CPD'!O$2))","v":""},{"$f":"IF(SUMIFS('07 PDR'!$F$4:$F$5600,'07 PDR'!$A$4:$A$5600,'05 CPD'!$A15,'07 PDR'!$K$4:$K$5600,'05 CPD'!P$2)=0,\"\",SUMIFS('07 PDR'!$F$4:$F$5600,'07 PDR'!$A$4:$A$5600,'05 CPD'!$A15,'07 PDR'!$K$4:$K$5600,'05 CPD'!P$2))","v":""},{"$f":"IF(SUMIFS('07 PDR'!$F$4:$F$5600,'07 PDR'!$A$4:$A$5600,'05 CPD'!$A15,'07 PDR'!$K$4:$K$5600,'05 CPD'!Q$2)=0,\"\",SUMIFS('07 PDR'!$F$4:$F$5600,'07 PDR'!$A$4:$A$5600,'05 CPD'!$A15,'07 PDR'!$K$4:$K$5600,'05 CPD'!Q$2))","v":""},{"$f":"IF(SUMIFS('07 PDR'!$F$4:$F$5600,'07 PDR'!$A$4:$A$5600,'05 CPD'!$A15,'07 PDR'!$K$4:$K$5600,'05 CPD'!R$2)=0,\"\",SUMIFS('07 PDR'!$F$4:$F$5600,'07 PDR'!$A$4:$A$5600,'05 CPD'!$A15,'07 PDR'!$K$4:$K$5600,'05 CPD'!R$2))","v":""},null,{"$f":"IF(SUMIFS('07 PDR'!$F$4:$F$5600,'07 PDR'!$A$4:$A$5600,'05 CPD'!$A15,'07 PDR'!$L$4:$L$5600,'05 CPD'!T$2)=0,\"\",SUMIFS('07 PDR'!$F$4:$F$5600,'07 PDR'!$A$4:$A$5600,'05 CPD'!$A15,'07 PDR'!$L$4:$L$5600,'05 CPD'!T$2))","v":""},{"$f":"IF(SUMIFS('07 PDR'!$F$4:$F$5600,'07 PDR'!$A$4:$A$5600,'05 CPD'!$A15,'07 PDR'!$L$4:$L$5600,'05 CPD'!U$2)=0,\"\",SUMIFS('07 PDR'!$F$4:$F$5600,'07 PDR'!$A$4:$A$5600,'05 CPD'!$A15,'07 PDR'!$L$4:$L$5600,'05 CPD'!U$2))","v":""},{"$f":"IF(SUMIFS('07 PDR'!$F$4:$F$5600,'07 PDR'!$A$4:$A$5600,'05 CPD'!$A15,'07 PDR'!$L$4:$L$5600,'05 CPD'!V$2)=0,\"\",SUMIFS('07 PDR'!$F$4:$F$5600,'07 PDR'!$A$4:$A$5600,'05 CPD'!$A15,'07 PDR'!$L$4:$L$5600,'05 CPD'!V$2))","v":""},{"$f":"IF(SUMIFS('07 PDR'!$F$4:$F$5600,'07 PDR'!$A$4:$A$5600,'05 CPD'!$A15,'07 PDR'!$L$4:$L$5600,'05 CPD'!W$2)=0,\"\",SUMIFS('07 PDR'!$F$4:$F$5600,'07 PDR'!$A$4:$A$5600,'05 CPD'!$A15,'07 PDR'!$L$4:$L$5600,'05 CPD'!W$2))","v":""},{"$f":"IF(SUMIFS('07 PDR'!$F$4:$F$5600,'07 PDR'!$A$4:$A$5600,'05 CPD'!$A15,'07 PDR'!$L$4:$L$5600,'05 CPD'!X$2)=0,\"\",SUMIFS('07 PDR'!$F$4:$F$5600,'07 PDR'!$A$4:$A$5600,'05 CPD'!$A15,'07 PDR'!$L$4:$L$5600,'05 CPD'!X$2))","v":""},{"$f":"IF(SUMIFS('07 PDR'!$F$4:$F$5600,'07 PDR'!$A$4:$A$5600,'05 CPD'!$A15,'07 PDR'!$L$4:$L$5600,'05 CPD'!Y$2)=0,\"\",SUMIFS('07 PDR'!$F$4:$F$5600,'07 PDR'!$A$4:$A$5600,'05 CPD'!$A15,'07 PDR'!$L$4:$L$5600,'05 CPD'!Y$2))","v":""},{"$f":"IF(SUMIFS('07 PDR'!$F$4:$F$5600,'07 PDR'!$A$4:$A$5600,'05 CPD'!$A15,'07 PDR'!$L$4:$L$5600,'05 CPD'!Z$2)=0,\"\",SUMIFS('07 PDR'!$F$4:$F$5600,'07 PDR'!$A$4:$A$5600,'05 CPD'!$A15,'07 PDR'!$L$4:$L$5600,'05 CPD'!Z$2))","v":""},{"$f":"IF(SUMIFS('07 PDR'!$F$4:$F$5600,'07 PDR'!$A$4:$A$5600,'05 CPD'!$A15,'07 PDR'!$L$4:$L$5600,'05 CPD'!AA$2)=0,\"\",SUMIFS('07 PDR'!$F$4:$F$5600,'07 PDR'!$A$4:$A$5600,'05 CPD'!$A15,'07 PDR'!$L$4:$L$5600,'05 CPD'!AA$2))","v":""},{"$f":"IF(SUMIFS('07 PDR'!$F$4:$F$5600,'07 PDR'!$A$4:$A$5600,'05 CPD'!$A15,'07 PDR'!$L$4:$L$5600,'05 CPD'!AB$2)=0,\"\",SUMIFS('07 PDR'!$F$4:$F$5600,'07 PDR'!$A$4:$A$5600,'05 CPD'!$A15,'07 PDR'!$L$4:$L$5600,'05 CPD'!AB$2))","v":""},{"$f":"IF(SUMIFS('07 PDR'!$F$4:$F$5600,'07 PDR'!$A$4:$A$5600,'05 CPD'!$A15,'07 PDR'!$L$4:$L$5600,'05 CPD'!AC$2)=0,\"\",SUMIFS('07 PDR'!$F$4:$F$5600,'07 PDR'!$A$4:$A$5600,'05 CPD'!$A15,'07 PDR'!$L$4:$L$5600,'05 CPD'!AC$2))","v":""},{"$f":"IF(SUMIFS('07 PDR'!$F$4:$F$5600,'07 PDR'!$A$4:$A$5600,'05 CPD'!$A15,'07 PDR'!$L$4:$L$5600,'05 CPD'!AD$2)=0,\"\",SUMIFS('07 PDR'!$F$4:$F$5600,'07 PDR'!$A$4:$A$5600,'05 CPD'!$A15,'07 PDR'!$L$4:$L$5600,'05 CPD'!AD$2))","v":""},{"$f":"IF(SUMIFS('07 PDR'!$F$4:$F$5600,'07 PDR'!$A$4:$A$5600,'05 CPD'!$A15,'07 PDR'!$L$4:$L$5600,'05 CPD'!AE$2)=0,\"\",SUMIFS('07 PDR'!$F$4:$F$5600,'07 PDR'!$A$4:$A$5600,'05 CPD'!$A15,'07 PDR'!$L$4:$L$5600,'05 CPD'!AE$2))","v":""},{"$f":"IF(SUMIFS('07 PDR'!$F$4:$F$5600,'07 PDR'!$A$4:$A$5600,'05 CPD'!$A15,'07 PDR'!$L$4:$L$5600,'05 CPD'!AF$2)=0,\"\",SUMIFS('07 PDR'!$F$4:$F$5600,'07 PDR'!$A$4:$A$5600,'05 CPD'!$A15,'07 PDR'!$L$4:$L$5600,'05 CPD'!AF$2))","v":""}]
["<Insert Period Range for Period 15>","","","",null,null,null,{"$f":"IF(SUMIFS('07 PDR'!$F$4:$F$5600,'07 PDR'!$A$4:$A$5600,'05 CPD'!$A16,'07 PDR'!$K$4:$K$5600,'05 CPD'!H$2)=0,\"\",SUMIFS('07 PDR'!$F$4:$F$5600,'07 PDR'!$A$4:$A$5600,'05 CPD'!$A16,'07 PDR'!$K$4:$K$5600,'05 CPD'!H$2))","v":""},{"$f":"IF(SUMIFS('07 PDR'!$F$4:$F$5600,'07 PDR'!$A$4:$A$5600,'05 CPD'!$A16,'07 PDR'!$K$4:$K$5600,'05 CPD'!I$2)=0,\"\",SUMIFS('07 PDR'!$F$4:$F$5600,'07 PDR'!$A$4:$A$5600,'05 CPD'!$A16,'07 PDR'!$K$4:$K$5600,'05 CPD'!I$2))","v":""},{"$f":"IF(SUMIFS('07 PDR'!$F$4:$F$5600,'07 PDR'!$A$4:$A$5600,'05 CPD'!$A16,'07 PDR'!$K$4:$K$5600,'05 CPD'!J$2)=0,\"\",SUMIFS('07 PDR'!$F$4:$F$5600,'07 PDR'!$A$4:$A$5600,'05 CPD'!$A16,'07 PDR'!$K$4:$K$5600,'05 CPD'!J$2))","v":""},{"$f":"IF(SUMIFS('07 PDR'!$F$4:$F$5600,'07 PDR'!$A$4:$A$5600,'05 CPD'!$A16,'07 PDR'!$K$4:$K$5600,'05 CPD'!K$2)=0,\"\",SUMIFS('07 PDR'!$F$4:$F$5600,'07 PDR'!$A$4:$A$5600,'05 CPD'!$A16,'07 PDR'!$K$4:$K$5600,'05 CPD'!K$2))","v":""},{"$f":"IF(SUMIFS('07 PDR'!$F$4:$F$5600,'07 PDR'!$A$4:$A$5600,'05 CPD'!$A16,'07 PDR'!$K$4:$K$5600,'05 CPD'!L$2)=0,\"\",SUMIFS('07 PDR'!$F$4:$F$5600,'07 PDR'!$A$4:$A$5600,'05 CPD'!$A16,'07 PDR'!$K$4:$K$5600,'05 CPD'!L$2))","v":""},{"$f":"IF(SUMIFS('07 PDR'!$F$4:$F$5600,'07 PDR'!$A$4:$A$5600,'05 CPD'!$A16,'07 PDR'!$K$4:$K$5600,'05 CPD'!M$2)=0,\"\",SUMIFS('07 PDR'!$F$4:$F$5600,'07 PDR'!$A$4:$A$5600,'05 CPD'!$A16,'07 PDR'!$K$4:$K$5600,'05 CPD'!M$2))","v":""},{"$f":"IF(SUMIFS('07 PDR'!$F$4:$F$5600,'07 PDR'!$A$4:$A$5600,'05 CPD'!$A16,'07 PDR'!$K$4:$K$5600,'05 CPD'!N$2)=0,\"\",SUMIFS('07 PDR'!$F$4:$F$5600,'07 PDR'!$A$4:$A$5600,'05 CPD'!$A16,'07 PDR'!$K$4:$K$5600,'05 CPD'!N$2))","v":""},{"$f":"IF(SUMIFS('07 PDR'!$F$4:$F$5600,'07 PDR'!$A$4:$A$5600,'05 CPD'!$A16,'07 PDR'!$K$4:$K$5600,'05 CPD'!O$2)=0,\"\",SUMIFS('07 PDR'!$F$4:$F$5600,'07 PDR'!$A$4:$A$5600,'05 CPD'!$A16,'07 PDR'!$K$4:$K$5600,'05 CPD'!O$2))","v":""},{"$f":"IF(SUMIFS('07 PDR'!$F$4:$F$5600,'07 PDR'!$A$4:$A$5600,'05 CPD'!$A16,'07 PDR'!$K$4:$K$5600,'05 CPD'!P$2)=0,\"\",SUMIFS('07 PDR'!$F$4:$F$5600,'07 PDR'!$A$4:$A$5600,'05 CPD'!$A16,'07 PDR'!$K$4:$K$5600,'05 CPD'!P$2))","v":""},{"$f":"IF(SUMIFS('07 PDR'!$F$4:$F$5600,'07 PDR'!$A$4:$A$5600,'05 CPD'!$A16,'07 PDR'!$K$4:$K$5600,'05 CPD'!Q$2)=0,\"\",SUMIFS('07 PDR'!$F$4:$F$5600,'07 PDR'!$A$4:$A$5600,'05 CPD'!$A16,'07 PDR'!$K$4:$K$5600,'05 CPD'!Q$2))","v":""},{"$f":"IF(SUMIFS('07 PDR'!$F$4:$F$5600,'07 PDR'!$A$4:$A$5600,'05 CPD'!$A16,'07 PDR'!$K$4:$K$5600,'05 CPD'!R$2)=0,\"\",SUMIFS('07 PDR'!$F$4:$F$5600,'07 PDR'!$A$4:$A$5600,'05 CPD'!$A16,'07 PDR'!$K$4:$K$5600,'05 CPD'!R$2))","v":""},null,{"$f":"IF(SUMIFS('07 PDR'!$F$4:$F$5600,'07 PDR'!$A$4:$A$5600,'05 CPD'!$A16,'07 PDR'!$L$4:$L$5600,'05 CPD'!T$2)=0,\"\",SUMIFS('07 PDR'!$F$4:$F$5600,'07 PDR'!$A$4:$A$5600,'05 CPD'!$A16,'07 PDR'!$L$4:$L$5600,'05 CPD'!T$2))","v":""},{"$f":"IF(SUMIFS('07 PDR'!$F$4:$F$5600,'07 PDR'!$A$4:$A$5600,'05 CPD'!$A16,'07 PDR'!$L$4:$L$5600,'05 CPD'!U$2)=0,\"\",SUMIFS('07 PDR'!$F$4:$F$5600,'07 PDR'!$A$4:$A$5600,'05 CPD'!$A16,'07 PDR'!$L$4:$L$5600,'05 CPD'!U$2))","v":""},{"$f":"IF(SUMIFS('07 PDR'!$F$4:$F$5600,'07 PDR'!$A$4:$A$5600,'05 CPD'!$A16,'07 PDR'!$L$4:$L$5600,'05 CPD'!V$2)=0,\"\",SUMIFS('07 PDR'!$F$4:$F$5600,'07 PDR'!$A$4:$A$5600,'05 CPD'!$A16,'07 PDR'!$L$4:$L$5600,'05 CPD'!V$2))","v":""},{"$f":"IF(SUMIFS('07 PDR'!$F$4:$F$5600,'07 PDR'!$A$4:$A$5600,'05 CPD'!$A16,'07 PDR'!$L$4:$L$5600,'05 CPD'!W$2)=0,\"\",SUMIFS('07 PDR'!$F$4:$F$5600,'07 PDR'!$A$4:$A$5600,'05 CPD'!$A16,'07 PDR'!$L$4:$L$5600,'05 CPD'!W$2))","v":""},{"$f":"IF(SUMIFS('07 PDR'!$F$4:$F$5600,'07 PDR'!$A$4:$A$5600,'05 CPD'!$A16,'07 PDR'!$L$4:$L$5600,'05 CPD'!X$2)=0,\"\",SUMIFS('07 PDR'!$F$4:$F$5600,'07 PDR'!$A$4:$A$5600,'05 CPD'!$A16,'07 PDR'!$L$4:$L$5600,'05 CPD'!X$2))","v":""},{"$f":"IF(SUMIFS('07 PDR'!$F$4:$F$5600,'07 PDR'!$A$4:$A$5600,'05 CPD'!$A16,'07 PDR'!$L$4:$L$5600,'05 CPD'!Y$2)=0,\"\",SUMIFS('07 PDR'!$F$4:$F$5600,'07 PDR'!$A$4:$A$5600,'05 CPD'!$A16,'07 PDR'!$L$4:$L$5600,'05 CPD'!Y$2))","v":""},{"$f":"IF(SUMIFS('07 PDR'!$F$4:$F$5600,'07 PDR'!$A$4:$A$5600,'05 CPD'!$A16,'07 PDR'!$L$4:$L$5600,'05 CPD'!Z$2)=0,\"\",SUMIFS('07 PDR'!$F$4:$F$5600,'07 PDR'!$A$4:$A$5600,'05 CPD'!$A16,'07 PDR'!$L$4:$L$5600,'05 CPD'!Z$2))","v":""},{"$f":"IF(SUMIFS('07 PDR'!$F$4:$F$5600,'07 PDR'!$A$4:$A$5600,'05 CPD'!$A16,'07 PDR'!$L$4:$L$5600,'05 CPD'!AA$2)=0,\"\",SUMIFS('07 PDR'!$F$4:$F$5600,'07 PDR'!$A$4:$A$5600,'05 CPD'!$A16,'07 PDR'!$L$4:$L$5600,'05 CPD'!AA$2))","v":""},{"$f":"IF(SUMIFS('07 PDR'!$F$4:$F$5600,'07 PDR'!$A$4:$A$5600,'05 CPD'!$A16,'07 PDR'!$L$4:$L$5600,'05 CPD'!AB$2)=0,\"\",SUMIFS('07 PDR'!$F$4:$F$5600,'07 PDR'!$A$4:$A$5600,'05 CPD'!$A16,'07 PDR'!$L$4:$L$5600,'05 CPD'!AB$2))","v":""},{"$f":"IF(SUMIFS('07 PDR'!$F$4:$F$5600,'07 PDR'!$A$4:$A$5600,'05 CPD'!$A16,'07 PDR'!$L$4:$L$5600,'05 CPD'!AC$2)=0,\"\",SUMIFS('07 PDR'!$F$4:$F$5600,'07 PDR'!$A$4:$A$5600,'05 CPD'!$A16,'07 PDR'!$L$4:$L$5600,'05 CPD'!AC$2))","v":""},{"$f":"IF(SUMIFS('07 PDR'!$F$4:$F$5600,'07 PDR'!$A$4:$A$5600,'05 CPD'!$A16,'07 PDR'!$L$4:$L$5600,'05 CPD'!AD$2)=0,\"\",SUMIFS('07 PDR'!$F$4:$F$5600,'07 PDR'!$A$4:$A$5600,'05 CPD'!$A16,'07 PDR'!$L$4:$L$5600,'05 CPD'!AD$2))","v":""},{"$f":"IF(SUMIFS('07 PDR'!$F$4:$F$5600,'07 PDR'!$A$4:$A$5600,'05 CPD'!$A16,'07 PDR'!$L$4:$L$5600,'05 CPD'!AE$2)=0,\"\",SUMIFS('07 PDR'!$F$4:$F$5600,'07 PDR'!$A$4:$A$5600,'05 CPD'!$A16,'07 PDR'!$L$4:$L$5600,'05 CPD'!AE$2))","v":""},{"$f":"IF(SUMIFS('07 PDR'!$F$4:$F$5600,'07 PDR'!$A$4:$A$5600,'05 CPD'!$A16,'07 PDR'!$L$4:$L$5600,'05 CPD'!AF$2)=0,\"\",SUMIFS('07 PDR'!$F$4:$F$5600,'07 PDR'!$A$4:$A$5600,'05 CPD'!$A16,'07 PDR'!$L$4:$L$5600,'05 CPD'!AF$2))","v":""}]
["<Insert Period Range for Period 15>","","","",null,null,null,{"$f":"IF(SUMIFS('07 PDR'!$F$4:$F$5600,'07 PDR'!$A$4:$A$5600,'05 CPD'!$A17,'07 PDR'!$K$4:$K$5600,'05 CPD'!H$2)=0,\"\",SUMIFS('07 PDR'!$F$4:$F$5600,'07 PDR'!$A$4:$A$5600,'05 CPD'!$A17,'07 PDR'!$K$4:$K$5600,'05 CPD'!H$2))","v":""},{"$f":"IF(SUMIFS('07 PDR'!$F$4:$F$5600,'07 PDR'!$A$4:$A$5600,'05 CPD'!$A17,'07 PDR'!$K$4:$K$5600,'05 CPD'!I$2)=0,\"\",SUMIFS('07 PDR'!$F$4:$F$5600,'07 PDR'!$A$4:$A$5600,'05 CPD'!$A17,'07 PDR'!$K$4:$K$5600,'05 CPD'!I$2))","v":""},{"$f":"IF(SUMIFS('07 PDR'!$F$4:$F$5600,'07 PDR'!$A$4:$A$5600,'05 CPD'!$A17,'07 PDR'!$K$4:$K$5600,'05 CPD'!J$2)=0,\"\",SUMIFS('07 PDR'!$F$4:$F$5600,'07 PDR'!$A$4:$A$5600,'05 CPD'!$A17,'07 PDR'!$K$4:$K$5600,'05 CPD'!J$2))","v":""},{"$f":"IF(SUMIFS('07 PDR'!$F$4:$F$5600,'07 PDR'!$A$4:$A$5600,'05 CPD'!$A17,'07 PDR'!$K$4:$K$5600,'05 CPD'!K$2)=0,\"\",SUMIFS('07 PDR'!$F$4:$F$5600,'07 PDR'!$A$4:$A$5600,'05 CPD'!$A17,'07 PDR'!$K$4:$K$5600,'05 CPD'!K$2))","v":""},{"$f":"IF(SUMIFS('07 PDR'!$F$4:$F$5600,'07 PDR'!$A$4:$A$5600,'05 CPD'!$A17,'07 PDR'!$K$4:$K$5600,'05 CPD'!L$2)=0,\"\",SUMIFS('07 PDR'!$F$4:$F$5600,'07 PDR'!$A$4:$A$5600,'05 CPD'!$A17,'07 PDR'!$K$4:$K$5600,'05 CPD'!L$2))","v":""},{"$f":"IF(SUMIFS('07 PDR'!$F$4:$F$5600,'07 PDR'!$A$4:$A$5600,'05 CPD'!$A17,'07 PDR'!$K$4:$K$5600,'05 CPD'!M$2)=0,\"\",SUMIFS('07 PDR'!$F$4:$F$5600,'07 PDR'!$A$4:$A$5600,'05 CPD'!$A17,'07 PDR'!$K$4:$K$5600,'05 CPD'!M$2))","v":""},{"$f":"IF(SUMIFS('07 PDR'!$F$4:$F$5600,'07 PDR'!$A$4:$A$5600,'05 CPD'!$A17,'07 PDR'!$K$4:$K$5600,'05 CPD'!N$2)=0,\"\",SUMIFS('07 PDR'!$F$4:$F$5600,'07 PDR'!$A$4:$A$5600,'05 CPD'!$A17,'07 PDR'!$K$4:$K$5600,'05 CPD'!N$2))","v":""},{"$f":"IF(SUMIFS('07 PDR'!$F$4:$F$5600,'07 PDR'!$A$4:$A$5600,'05 CPD'!$A17,'07 PDR'!$K$4:$K$5600,'05 CPD'!O$2)=0,\"\",SUMIFS('07 PDR'!$F$4:$F$5600,'07 PDR'!$A$4:$A$5600,'05 CPD'!$A17,'07 PDR'!$K$4:$K$5600,'05 CPD'!O$2))","v":""},{"$f":"IF(SUMIFS('07 PDR'!$F$4:$F$5600,'07 PDR'!$A$4:$A$5600,'05 CPD'!$A17,'07 PDR'!$K$4:$K$5600,'05 CPD'!P$2)=0,\"\",SUMIFS('07 PDR'!$F$4:$F$5600,'07 PDR'!$A$4:$A$5600,'05 CPD'!$A17,'07 PDR'!$K$4:$K$5600,'05 CPD'!P$2))","v":""},{"$f":"IF(SUMIFS('07 PDR'!$F$4:$F$5600,'07 PDR'!$A$4:$A$5600,'05 CPD'!$A17,'07 PDR'!$K$4:$K$5600,'05 CPD'!Q$2)=0,\"\",SUMIFS('07 PDR'!$F$4:$F$5600,'07 PDR'!$A$4:$A$5600,'05 CPD'!$A17,'07 PDR'!$K$4:$K$5600,'05 CPD'!Q$2))","v":""},{"$f":"IF(SUMIFS('07 PDR'!$F$4:$F$5600,'07 PDR'!$A$4:$A$5600,'05 CPD'!$A17,'07 PDR'!$K$4:$K$5600,'05 CPD'!R$2)=0,\"\",SUMIFS('07 PDR'!$F$4:$F$5600,'07 PDR'!$A$4:$A$5600,'05 CPD'!$A17,'07 PDR'!$K$4:$K$5600,'05 CPD'!R$2))","v":""},null,{"$f":"IF(SUMIFS('07 PDR'!$F$4:$F$5600,'07 PDR'!$A$4:$A$5600,'05 CPD'!$A17,'07 PDR'!$L$4:$L$5600,'05 CPD'!T$2)=0,\"\",SUMIFS('07 PDR'!$F$4:$F$5600,'07 PDR'!$A$4:$A$5600,'05 CPD'!$A17,'07 PDR'!$L$4:$L$5600,'05 CPD'!T$2))","v":""},{"$f":"IF(SUMIFS('07 PDR'!$F$4:$F$5600,'07 PDR'!$A$4:$A$5600,'05 CPD'!$A17,'07 PDR'!$L$4:$L$5600,'05 CPD'!U$2)=0,\"\",SUMIFS('07 PDR'!$F$4:$F$5600,'07 PDR'!$A$4:$A$5600,'05 CPD'!$A17,'07 PDR'!$L$4:$L$5600,'05 CPD'!U$2))","v":""},{"$f":"IF(SUMIFS('07 PDR'!$F$4:$F$5600,'07 PDR'!$A$4:$A$5600,'05 CPD'!$A17,'07 PDR'!$L$4:$L$5600,'05 CPD'!V$2)=0,\"\",SUMIFS('07 PDR'!$F$4:$F$5600,'07 PDR'!$A$4:$A$5600,'05 CPD'!$A17,'07 PDR'!$L$4:$L$5600,'05 CPD'!V$2))","v":""},{"$f":"IF(SUMIFS('07 PDR'!$F$4:$F$5600,'07 PDR'!$A$4:$A$5600,'05 CPD'!$A17,'07 PDR'!$L$4:$L$5600,'05 CPD'!W$2)=0,\"\",SUMIFS('07 PDR'!$F$4:$F$5600,'07 PDR'!$A$4:$A$5600,'05 CPD'!$A17,'07 PDR'!$L$4:$L$5600,'05 CPD'!W$2))","v":""},{"$f":"IF(SUMIFS('07 PDR'!$F$4:$F$5600,'07 PDR'!$A$4:$A$5600,'05 CPD'!$A17,'07 PDR'!$L$4:$L$5600,'05 CPD'!X$2)=0,\"\",SUMIFS('07 PDR'!$F$4:$F$5600,'07 PDR'!$A$4:$A$5600,'05 CPD'!$A17,'07 PDR'!$L$4:$L$5600,'05 CPD'!X$2))","v":""},{"$f":"IF(SUMIFS('07 PDR'!$F$4:$F$5600,'07 PDR'!$A$4:$A$5600,'05 CPD'!$A17,'07 PDR'!$L$4:$L$5600,'05 CPD'!Y$2)=0,\"\",SUMIFS('07 PDR'!$F$4:$F$5600,'07 PDR'!$A$4:$A$5600,'05 CPD'!$A17,'07 PDR'!$L$4:$L$5600,'05 CPD'!Y$2))","v":""},{"$f":"IF(SUMIFS('07 PDR'!$F$4:$F$5600,'07 PDR'!$A$4:$A$5600,'05 CPD'!$A17,'07 PDR'!$L$4:$L$5600,'05 CPD'!Z$2)=0,\"\",SUMIFS('07 PDR'!$F$4:$F$5600,'07 PDR'!$A$4:$A$5600,'05 CPD'!$A17,'07 PDR'!$L$4:$L$5600,'05 CPD'!Z$2))","v":""},{"$f":"IF(SUMIFS('07 PDR'!$F$4:$F$5600,'07 PDR'!$A$4:$A$5600,'05 CPD'!$A17,'07 PDR'!$L$4:$L$5600,'05 CPD'!AA$2)=0,\"\",SUMIFS('07 PDR'!$F$4:$F$5600,'07 PDR'!$A$4:$A$5600,'05 CPD'!$A17,'07 PDR'!$L$4:$L$5600,'05 CPD'!AA$2))","v":""},{"$f":"IF(SUMIFS('07 PDR'!$F$4:$F$5600,'07 PDR'!$A$4:$A$5600,'05 CPD'!$A17,'07 PDR'!$L$4:$L$5600,'05 CPD'!AB$2)=0,\"\",SUMIFS('07 PDR'!$F$4:$F$5600,'07 PDR'!$A$4:$A$5600,'05 CPD'!$A17,'07 PDR'!$L$4:$L$5600,'05 CPD'!AB$2))","v":""},{"$f":"IF(SUMIFS('07 PDR'!$F$4:$F$5600,'07 PDR'!$A$4:$A$5600,'05 CPD'!$A17,'07 PDR'!$L$4:$L$5600,'05 CPD'!AC$2)=0,\"\",SUMIFS('07 PDR'!$F$4:$F$5600,'07 PDR'!$A$4:$A$5600,'05 CPD'!$A17,'07 PDR'!$L$4:$L$5600,'05 CPD'!AC$2))","v":""},{"$f":"IF(SUMIFS('07 PDR'!$F$4:$F$5600,'07 PDR'!$A$4:$A$5600,'05 CPD'!$A17,'07 PDR'!$L$4:$L$5600,'05 CPD'!AD$2)=0,\"\",SUMIFS('07 PDR'!$F$4:$F$5600,'07 PDR'!$A$4:$A$5600,'05 CPD'!$A17,'07 PDR'!$L$4:$L$5600,'05 CPD'!AD$2))","v":""},{"$f":"IF(SUMIFS('07 PDR'!$F$4:$F$5600,'07 PDR'!$A$4:$A$5600,'05 CPD'!$A17,'07 PDR'!$L$4:$L$5600,'05 CPD'!AE$2)=0,\"\",SUMIFS('07 PDR'!$F$4:$F$5600,'07 PDR'!$A$4:$A$5600,'05 CPD'!$A17,'07 PDR'!$L$4:$L$5600,'05 CPD'!AE$2))","v":""},{"$f":"IF(SUMIFS('07 PDR'!$F$4:$F$5600,'07 PDR'!$A$4:$A$5600,'05 CPD'!$A17,'07 PDR'!$L$4:$L$5600,'05 CPD'!AF$2)=0,\"\",SUMIFS('07 PDR'!$F$4:$F$5600,'07 PDR'!$A$4:$A$5600,'05 CPD'!$A17,'07 PDR'!$L$4:$L$5600,'05 CPD'!AF$2))","v":""}]
["<Insert Period Range for Period 16>","","","",null,null,null,{"$f":"IF(SUMIFS('07 PDR'!$F$4:$F$5600,'07 PDR'!$A$4:$A$5600,'05 CPD'!$A18,'07 PDR'!$K$4:$K$5600,'05 CPD'!H$2)=0,\"\",SUMIFS('07 PDR'!$F$4:$F$5600,'07 PDR'!$A$4:$A$5600,'05 CPD'!$A18,'07 PDR'!$K$4:$K$5600,'05 CPD'!H$2))","v":""},{"$f":"IF(SUMIFS('07 PDR'!$F$4:$F$5600,'07 PDR'!$A$4:$A$5600,'05 CPD'!$A18,'07 PDR'!$K$4:$K$5600,'05 CPD'!I$2)=0,\"\",SUMIFS('07 PDR'!$F$4:$F$5600,'07 PDR'!$A$4:$A$5600,'05 CPD'!$A18,'07 PDR'!$K$4:$K$5600,'05 CPD'!I$2))","v":""},{"$f":"IF(SUMIFS('07 PDR'!$F$4:$F$5600,'07 PDR'!$A$4:$A$5600,'05 CPD'!$A18,'07 PDR'!$K$4:$K$5600,'05 CPD'!J$2)=0,\"\",SUMIFS('07 PDR'!$F$4:$F$5600,'07 PDR'!$A$4:$A$5600,'05 CPD'!$A18,'07 PDR'!$K$4:$K$5600,'05 CPD'!J$2))","v":""},{"$f":"IF(SUMIFS('07 PDR'!$F$4:$F$5600,'07 PDR'!$A$4:$A$5600,'05 CPD'!$A18,'07 PDR'!$K$4:$K$5600,'05 CPD'!K$2)=0,\"\",SUMIFS('07 PDR'!$F$4:$F$5600,'07 PDR'!$A$4:$A$5600,'05 CPD'!$A18,'07 PDR'!$K$4:$K$5600,'05 CPD'!K$2))","v":""},{"$f":"IF(SUMIFS('07 PDR'!$F$4:$F$5600,'07 PDR'!$A$4:$A$5600,'05 CPD'!$A18,'07 PDR'!$K$4:$K$5600,'05 CPD'!L$2)=0,\"\",SUMIFS('07 PDR'!$F$4:$F$5600,'07 PDR'!$A$4:$A$5600,'05 CPD'!$A18,'07 PDR'!$K$4:$K$5600,'05 CPD'!L$2))","v":""},{"$f":"IF(SUMIFS('07 PDR'!$F$4:$F$5600,'07 PDR'!$A$4:$A$5600,'05 CPD'!$A18,'07 PDR'!$K$4:$K$5600,'05 CPD'!M$2)=0,\"\",SUMIFS('07 PDR'!$F$4:$F$5600,'07 PDR'!$A$4:$A$5600,'05 CPD'!$A18,'07 PDR'!$K$4:$K$5600,'05 CPD'!M$2))","v":""},{"$f":"IF(SUMIFS('07 PDR'!$F$4:$F$5600,'07 PDR'!$A$4:$A$5600,'05 CPD'!$A18,'07 PDR'!$K$4:$K$5600,'05 CPD'!N$2)=0,\"\",SUMIFS('07 PDR'!$F$4:$F$5600,'07 PDR'!$A$4:$A$5600,'05 CPD'!$A18,'07 PDR'!$K$4:$K$5600,'05 CPD'!N$2))","v":""},{"$f":"IF(SUMIFS('07 PDR'!$F$4:$F$5600,'07 PDR'!$A$4:$A$5600,'05 CPD'!$A18,'07 PDR'!$K$4:$K$5600,'05 CPD'!O$2)=0,\"\",SUMIFS('07 PDR'!$F$4:$F$5600,'07 PDR'!$A$4:$A$5600,'05 CPD'!$A18,'07 PDR'!$K$4:$K$5600,'05 CPD'!O$2))","v":""},{"$f":"IF(SUMIFS('07 PDR'!$F$4:$F$5600,'07 PDR'!$A$4:$A$5600,'05 CPD'!$A18,'07 PDR'!$K$4:$K$5600,'05 CPD'!P$2)=0,\"\",SUMIFS('07 PDR'!$F$4:$F$5600,'07 PDR'!$A$4:$A$5600,'05 CPD'!$A18,'07 PDR'!$K$4:$K$5600,'05 CPD'!P$2))","v":""},{"$f":"IF(SUMIFS('07 PDR'!$F$4:$F$5600,'07 PDR'!$A$4:$A$5600,'05 CPD'!$A18,'07 PDR'!$K$4:$K$5600,'05 CPD'!Q$2)=0,\"\",SUMIFS('07 PDR'!$F$4:$F$5600,'07 PDR'!$A$4:$A$5600,'05 CPD'!$A18,'07 PDR'!$K$4:$K$5600,'05 CPD'!Q$2))","v":""},{"$f":"IF(SUMIFS('07 PDR'!$F$4:$F$5600,'07 PDR'!$A$4:$A$5600,'05 CPD'!$A18,'07 PDR'!$K$4:$K$5600,'05 CPD'!R$2)=0,\"\",SUMIFS('07 PDR'!$F$4:$F$5600,'07 PDR'!$A$4:$A$5600,'05 CPD'!$A18,'07 PDR'!$K$4:$K$5600,'05 CPD'!R$2))","v":""},null,{"$f":"IF(SUMIFS('07 PDR'!$F$4:$F$5600,'07 PDR'!$A$4:$A$5600,'05 CPD'!$A18,'07 PDR'!$L$4:$L$5600,'05 CPD'!T$2)=0,\"\",SUMIFS('07 PDR'!$F$4:$F$5600,'07 PDR'!$A$4:$A$5600,'05 CPD'!$A18,'07 PDR'!$L$4:$L$5600,'05 CPD'!T$2))","v":""},{"$f":"IF(SUMIFS('07 PDR'!$F$4:$F$5600,'07 PDR'!$A$4:$A$5600,'05 CPD'!$A18,'07 PDR'!$L$4:$L$5600,'05 CPD'!U$2)=0,\"\",SUMIFS('07 PDR'!$F$4:$F$5600,'07 PDR'!$A$4:$A$5600,'05 CPD'!$A18,'07 PDR'!$L$4:$L$5600,'05 CPD'!U$2))","v":""},{"$f":"IF(SUMIFS('07 PDR'!$F$4:$F$5600,'07 PDR'!$A$4:$A$5600,'05 CPD'!$A18,'07 PDR'!$L$4:$L$5600,'05 CPD'!V$2)=0,\"\",SUMIFS('07 PDR'!$F$4:$F$5600,'07 PDR'!$A$4:$A$5600,'05 CPD'!$A18,'07 PDR'!$L$4:$L$5600,'05 CPD'!V$2))","v":""},{"$f":"IF(SUMIFS('07 PDR'!$F$4:$F$5600,'07 PDR'!$A$4:$A$5600,'05 CPD'!$A18,'07 PDR'!$L$4:$L$5600,'05 CPD'!W$2)=0,\"\",SUMIFS('07 PDR'!$F$4:$F$5600,'07 PDR'!$A$4:$A$5600,'05 CPD'!$A18,'07 PDR'!$L$4:$L$5600,'05 CPD'!W$2))","v":""},{"$f":"IF(SUMIFS('07 PDR'!$F$4:$F$5600,'07 PDR'!$A$4:$A$5600,'05 CPD'!$A18,'07 PDR'!$L$4:$L$5600,'05 CPD'!X$2)=0,\"\",SUMIFS('07 PDR'!$F$4:$F$5600,'07 PDR'!$A$4:$A$5600,'05 CPD'!$A18,'07 PDR'!$L$4:$L$5600,'05 CPD'!X$2))","v":""},{"$f":"IF(SUMIFS('07 PDR'!$F$4:$F$5600,'07 PDR'!$A$4:$A$5600,'05 CPD'!$A18,'07 PDR'!$L$4:$L$5600,'05 CPD'!Y$2)=0,\"\",SUMIFS('07 PDR'!$F$4:$F$5600,'07 PDR'!$A$4:$A$5600,'05 CPD'!$A18,'07 PDR'!$L$4:$L$5600,'05 CPD'!Y$2))","v":""},{"$f":"IF(SUMIFS('07 PDR'!$F$4:$F$5600,'07 PDR'!$A$4:$A$5600,'05 CPD'!$A18,'07 PDR'!$L$4:$L$5600,'05 CPD'!Z$2)=0,\"\",SUMIFS('07 PDR'!$F$4:$F$5600,'07 PDR'!$A$4:$A$5600,'05 CPD'!$A18,'07 PDR'!$L$4:$L$5600,'05 CPD'!Z$2))","v":""},{"$f":"IF(SUMIFS('07 PDR'!$F$4:$F$5600,'07 PDR'!$A$4:$A$5600,'05 CPD'!$A18,'07 PDR'!$L$4:$L$5600,'05 CPD'!AA$2)=0,\"\",SUMIFS('07 PDR'!$F$4:$F$5600,'07 PDR'!$A$4:$A$5600,'05 CPD'!$A18,'07 PDR'!$L$4:$L$5600,'05 CPD'!AA$2))","v":""},{"$f":"IF(SUMIFS('07 PDR'!$F$4:$F$5600,'07 PDR'!$A$4:$A$5600,'05 CPD'!$A18,'07 PDR'!$L$4:$L$5600,'05 CPD'!AB$2)=0,\"\",SUMIFS('07 PDR'!$F$4:$F$5600,'07 PDR'!$A$4:$A$5600,'05 CPD'!$A18,'07 PDR'!$L$4:$L$5600,'05 CPD'!AB$2))","v":""},{"$f":"IF(SUMIFS('07 PDR'!$F$4:$F$5600,'07 PDR'!$A$4:$A$5600,'05 CPD'!$A18,'07 PDR'!$L$4:$L$5600,'05 CPD'!AC$2)=0,\"\",SUMIFS('07 PDR'!$F$4:$F$5600,'07 PDR'!$A$4:$A$5600,'05 CPD'!$A18,'07 PDR'!$L$4:$L$5600,'05 CPD'!AC$2))","v":""},{"$f":"IF(SUMIFS('07 PDR'!$F$4:$F$5600,'07 PDR'!$A$4:$A$5600,'05 CPD'!$A18,'07 PDR'!$L$4:$L$5600,'05 CPD'!AD$2)=0,\"\",SUMIFS('07 PDR'!$F$4:$F$5600,'07 PDR'!$A$4:$A$5600,'05 CPD'!$A18,'07 PDR'!$L$4:$L$5600,'05 CPD'!AD$2))","v":""},{"$f":"IF(SUMIFS('07 PDR'!$F$4:$F$5600,'07 PDR'!$A$4:$A$5600,'05 CPD'!$A18,'07 PDR'!$L$4:$L$5600,'05 CPD'!AE$2)=0,\"\",SUMIFS('07 PDR'!$F$4:$F$5600,'07 PDR'!$A$4:$A$5600,'05 CPD'!$A18,'07 PDR'!$L$4:$L$5600,'05 CPD'!AE$2))","v":""},{"$f":"IF(SUMIFS('07 PDR'!$F$4:$F$5600,'07 PDR'!$A$4:$A$5600,'05 CPD'!$A18,'07 PDR'!$L$4:$L$5600,'05 CPD'!AF$2)=0,\"\",SUMIFS('07 PDR'!$F$4:$F$5600,'07 PDR'!$A$4:$A$5600,'05 CPD'!$A18,'07 PDR'!$L$4:$L$5600,'05 CPD'!AF$2))","v":""}]
["<Insert Period Range for Period 17>","","","",null,null,null,{"$f":"IF(SUMIFS('07 PDR'!$F$4:$F$5600,'07 PDR'!$A$4:$A$5600,'05 CPD'!$A19,'07 PDR'!$K$4:$K$5600,'05 CPD'!H$2)=0,\"\",SUMIFS('07 PDR'!$F$4:$F$5600,'07 PDR'!$A$4:$A$5600,'05 CPD'!$A19,'07 PDR'!$K$4:$K$5600,'05 CPD'!H$2))","v":""},{"$f":"IF(SUMIFS('07 PDR'!$F$4:$F$5600,'07 PDR'!$A$4:$A$5600,'05 CPD'!$A19,'07 PDR'!$K$4:$K$5600,'05 CPD'!I$2)=0,\"\",SUMIFS('07 PDR'!$F$4:$F$5600,'07 PDR'!$A$4:$A$5600,'05 CPD'!$A19,'07 PDR'!$K$4:$K$5600,'05 CPD'!I$2))","v":""},{"$f":"IF(SUMIFS('07 PDR'!$F$4:$F$5600,'07 PDR'!$A$4:$A$5600,'05 CPD'!$A19,'07 PDR'!$K$4:$K$5600,'05 CPD'!J$2)=0,\"\",SUMIFS('07 PDR'!$F$4:$F$5600,'07 PDR'!$A$4:$A$5600,'05 CPD'!$A19,'07 PDR'!$K$4:$K$5600,'05 CPD'!J$2))","v":""},{"$f":"IF(SUMIFS('07 PDR'!$F$4:$F$5600,'07 PDR'!$A$4:$A$5600,'05 CPD'!$A19,'07 PDR'!$K$4:$K$5600,'05 CPD'!K$2)=0,\"\",SUMIFS('07 PDR'!$F$4:$F$5600,'07 PDR'!$A$4:$A$5600,'05 CPD'!$A19,'07 PDR'!$K$4:$K$5600,'05 CPD'!K$2))","v":""},{"$f":"IF(SUMIFS('07 PDR'!$F$4:$F$5600,'07 PDR'!$A$4:$A$5600,'05 CPD'!$A19,'07 PDR'!$K$4:$K$5600,'05 CPD'!L$2)=0,\"\",SUMIFS('07 PDR'!$F$4:$F$5600,'07 PDR'!$A$4:$A$5600,'05 CPD'!$A19,'07 PDR'!$K$4:$K$5600,'05 CPD'!L$2))","v":""},{"$f":"IF(SUMIFS('07 PDR'!$F$4:$F$5600,'07 PDR'!$A$4:$A$5600,'05 CPD'!$A19,'07 PDR'!$K$4:$K$5600,'05 CPD'!M$2)=0,\"\",SUMIFS('07 PDR'!$F$4:$F$5600,'07 PDR'!$A$4:$A$5600,'05 CPD'!$A19,'07 PDR'!$K$4:$K$5600,'05 CPD'!M$2))","v":""},{"$f":"IF(SUMIFS('07 PDR'!$F$4:$F$5600,'07 PDR'!$A$4:$A$5600,'05 CPD'!$A19,'07 PDR'!$K$4:$K$5600,'05 CPD'!N$2)=0,\"\",SUMIFS('07 PDR'!$F$4:$F$5600,'07 PDR'!$A$4:$A$5600,'05 CPD'!$A19,'07 PDR'!$K$4:$K$5600,'05 CPD'!N$2))","v":""},{"$f":"IF(SUMIFS('07 PDR'!$F$4:$F$5600,'07 PDR'!$A$4:$A$5600,'05 CPD'!$A19,'07 PDR'!$K$4:$K$5600,'05 CPD'!O$2)=0,\"\",SUMIFS('07 PDR'!$F$4:$F$5600,'07 PDR'!$A$4:$A$5600,'05 CPD'!$A19,'07 PDR'!$K$4:$K$5600,'05 CPD'!O$2))","v":""},{"$f":"IF(SUMIFS('07 PDR'!$F$4:$F$5600,'07 PDR'!$A$4:$A$5600,'05 CPD'!$A19,'07 PDR'!$K$4:$K$5600,'05 CPD'!P$2)=0,\"\",SUMIFS('07 PDR'!$F$4:$F$5600,'07 PDR'!$A$4:$A$5600,'05 CPD'!$A19,'07 PDR'!$K$4:$K$5600,'05 CPD'!P$2))","v":""},{"$f":"IF(SUMIFS('07 PDR'!$F$4:$F$5600,'07 PDR'!$A$4:$A$5600,'05 CPD'!$A19,'07 PDR'!$K$4:$K$5600,'05 CPD'!Q$2)=0,\"\",SUMIFS('07 PDR'!$F$4:$F$5600,'07 PDR'!$A$4:$A$5600,'05 CPD'!$A19,'07 PDR'!$K$4:$K$5600,'05 CPD'!Q$2))","v":""},{"$f":"IF(SUMIFS('07 PDR'!$F$4:$F$5600,'07 PDR'!$A$4:$A$5600,'05 CPD'!$A19,'07 PDR'!$K$4:$K$5600,'05 CPD'!R$2)=0,\"\",SUMIFS('07 PDR'!$F$4:$F$5600,'07 PDR'!$A$4:$A$5600,'05 CPD'!$A19,'07 PDR'!$K$4:$K$5600,'05 CPD'!R$2))","v":""},null,{"$f":"IF(SUMIFS('07 PDR'!$F$4:$F$5600,'07 PDR'!$A$4:$A$5600,'05 CPD'!$A19,'07 PDR'!$L$4:$L$5600,'05 CPD'!T$2)=0,\"\",SUMIFS('07 PDR'!$F$4:$F$5600,'07 PDR'!$A$4:$A$5600,'05 CPD'!$A19,'07 PDR'!$L$4:$L$5600,'05 CPD'!T$2))","v":""},{"$f":"IF(SUMIFS('07 PDR'!$F$4:$F$5600,'07 PDR'!$A$4:$A$5600,'05 CPD'!$A19,'07 PDR'!$L$4:$L$5600,'05 CPD'!U$2)=0,\"\",SUMIFS('07 PDR'!$F$4:$F$5600,'07 PDR'!$A$4:$A$5600,'05 CPD'!$A19,'07 PDR'!$L$4:$L$5600,'05 CPD'!U$2))","v":""},{"$f":"IF(SUMIFS('07 PDR'!$F$4:$F$5600,'07 PDR'!$A$4:$A$5600,'05 CPD'!$A19,'07 PDR'!$L$4:$L$5600,'05 CPD'!V$2)=0,\"\",SUMIFS('07 PDR'!$F$4:$F$5600,'07 PDR'!$A$4:$A$5600,'05 CPD'!$A19,'07 PDR'!$L$4:$L$5600,'05 CPD'!V$2))","v":""},{"$f":"IF(SUMIFS('07 PDR'!$F$4:$F$5600,'07 PDR'!$A$4:$A$5600,'05 CPD'!$A19,'07 PDR'!$L$4:$L$5600,'05 CPD'!W$2)=0,\"\",SUMIFS('07 PDR'!$F$4:$F$5600,'07 PDR'!$A$4:$A$5600,'05 CPD'!$A19,'07 PDR'!$L$4:$L$5600,'05 CPD'!W$2))","v":""},{"$f":"IF(SUMIFS('07 PDR'!$F$4:$F$5600,'07 PDR'!$A$4:$A$5600,'05 CPD'!$A19,'07 PDR'!$L$4:$L$5600,'05 CPD'!X$2)=0,\"\",SUMIFS('07 PDR'!$F$4:$F$5600,'07 PDR'!$A$4:$A$5600,'05 CPD'!$A19,'07 PDR'!$L$4:$L$5600,'05 CPD'!X$2))","v":""},{"$f":"IF(SUMIFS('07 PDR'!$F$4:$F$5600,'07 PDR'!$A$4:$A$5600,'05 CPD'!$A19,'07 PDR'!$L$4:$L$5600,'05 CPD'!Y$2)=0,\"\",SUMIFS('07 PDR'!$F$4:$F$5600,'07 PDR'!$A$4:$A$5600,'05 CPD'!$A19,'07 PDR'!$L$4:$L$5600,'05 CPD'!Y$2))","v":""},{"$f":"IF(SUMIFS('07 PDR'!$F$4:$F$5600,'07 PDR'!$A$4:$A$5600,'05 CPD'!$A19,'07 PDR'!$L$4:$L$5600,'05 CPD'!Z$2)=0,\"\",SUMIFS('07 PDR'!$F$4:$F$5600,'07 PDR'!$A$4:$A$5600,'05 CPD'!$A19,'07 PDR'!$L$4:$L$5600,'05 CPD'!Z$2))","v":""},{"$f":"IF(SUMIFS('07 PDR'!$F$4:$F$5600,'07 PDR'!$A$4:$A$5600,'05 CPD'!$A19,'07 PDR'!$L$4:$L$5600,'05 CPD'!AA$2)=0,\"\",SUMIFS('07 PDR'!$F$4:$F$5600,'07 PDR'!$A$4:$A$5600,'05 CPD'!$A19,'07 PDR'!$L$4:$L$5600,'05 CPD'!AA$2))","v":""},{"$f":"IF(SUMIFS('07 PDR'!$F$4:$F$5600,'07 PDR'!$A$4:$A$5600,'05 CPD'!$A19,'07 PDR'!$L$4:$L$5600,'05 CPD'!AB$2)=0,\"\",SUMIFS('07 PDR'!$F$4:$F$5600,'07 PDR'!$A$4:$A$5600,'05 CPD'!$A19,'07 PDR'!$L$4:$L$5600,'05 CPD'!AB$2))","v":""},{"$f":"IF(SUMIFS('07 PDR'!$F$4:$F$5600,'07 PDR'!$A$4:$A$5600,'05 CPD'!$A19,'07 PDR'!$L$4:$L$5600,'05 CPD'!AC$2)=0,\"\",SUMIFS('07 PDR'!$F$4:$F$5600,'07 PDR'!$A$4:$A$5600,'05 CPD'!$A19,'07 PDR'!$L$4:$L$5600,'05 CPD'!AC$2))","v":""},{"$f":"IF(SUMIFS('07 PDR'!$F$4:$F$5600,'07 PDR'!$A$4:$A$5600,'05 CPD'!$A19,'07 PDR'!$L$4:$L$5600,'05 CPD'!AD$2)=0,\"\",SUMIFS('07 PDR'!$F$4:$F$5600,'07 PDR'!$A$4:$A$5600,'05 CPD'!$A19,'07 PDR'!$L$4:$L$5600,'05 CPD'!AD$2))","v":""},{"$f":"IF(SUMIFS('07 PDR'!$F$4:$F$5600,'07 PDR'!$A$4:$A$5600,'05 CPD'!$A19,'07 PDR'!$L$4:$L$5600,'05 CPD'!AE$2)=0,\"\",SUMIFS('07 PDR'!$F$4:$F$5600,'07 PDR'!$A$4:$A$5600,'05 CPD'!$A19,'07 PDR'!$L$4:$L$5600,'05 CPD'!AE$2))","v":""},{"$f":"IF(SUMIFS('07 PDR'!$F$4:$F$5600,'07 PDR'!$A$4:$A$5600,'05 CPD'!$A19,'07 PDR'!$L$4:$L$5600,'05 CPD'!AF$2)=0,\"\",SUMIFS('07 PDR'!$F$4:$F$5600,'07 PDR'!$A$4:$A$5600,'05 CPD'!$A19,'07 PDR'!$L$4:$L$5600,'05 CPD'!AF$2))","v":""}]
["<Insert Period Range for Period 18>","","","",null,null,null,{"$f":"IF(SUMIFS('07 PDR'!$F$4:$F$5600,'07 PDR'!$A$4:$A$5600,'05 CPD'!$A20,'07 PDR'!$K$4:$K$5600,'05 CPD'!H$2)=0,\"\",SUMIFS('07 PDR'!$F$4:$F$5600,'07 PDR'!$A$4:$A$5600,'05 CPD'!$A20,'07 PDR'!$K$4:$K$5600,'05 CPD'!H$2))","v":""},{"$f":"IF(SUMIFS('07 PDR'!$F$4:$F$5600,'07 PDR'!$A$4:$A$5600,'05 CPD'!$A20,'07 PDR'!$K$4:$K$5600,'05 CPD'!I$2)=0,\"\",SUMIFS('07 PDR'!$F$4:$F$5600,'07 PDR'!$A$4:$A$5600,'05 CPD'!$A20,'07 PDR'!$K$4:$K$5600,'05 CPD'!I$2))","v":""},{"$f":"IF(SUMIFS('07 PDR'!$F$4:$F$5600,'07 PDR'!$A$4:$A$5600,'05 CPD'!$A20,'07 PDR'!$K$4:$K$5600,'05 CPD'!J$2)=0,\"\",SUMIFS('07 PDR'!$F$4:$F$5600,'07 PDR'!$A$4:$A$5600,'05 CPD'!$A20,'07 PDR'!$K$4:$K$5600,'05 CPD'!J$2))","v":""},{"$f":"IF(SUMIFS('07 PDR'!$F$4:$F$5600,'07 PDR'!$A$4:$A$5600,'05 CPD'!$A20,'07 PDR'!$K$4:$K$5600,'05 CPD'!K$2)=0,\"\",SUMIFS('07 PDR'!$F$4:$F$5600,'07 PDR'!$A$4:$A$5600,'05 CPD'!$A20,'07 PDR'!$K$4:$K$5600,'05 CPD'!K$2))","v":""},{"$f":"IF(SUMIFS('07 PDR'!$F$4:$F$5600,'07 PDR'!$A$4:$A$5600,'05 CPD'!$A20,'07 PDR'!$K$4:$K$5600,'05 CPD'!L$2)=0,\"\",SUMIFS('07 PDR'!$F$4:$F$5600,'07 PDR'!$A$4:$A$5600,'05 CPD'!$A20,'07 PDR'!$K$4:$K$5600,'05 CPD'!L$2))","v":""},{"$f":"IF(SUMIFS('07 PDR'!$F$4:$F$5600,'07 PDR'!$A$4:$A$5600,'05 CPD'!$A20,'07 PDR'!$K$4:$K$5600,'05 CPD'!M$2)=0,\"\",SUMIFS('07 PDR'!$F$4:$F$5600,'07 PDR'!$A$4:$A$5600,'05 CPD'!$A20,'07 PDR'!$K$4:$K$5600,'05 CPD'!M$2))","v":""},{"$f":"IF(SUMIFS('07 PDR'!$F$4:$F$5600,'07 PDR'!$A$4:$A$5600,'05 CPD'!$A20,'07 PDR'!$K$4:$K$5600,'05 CPD'!N$2)=0,\"\",SUMIFS('07 PDR'!$F$4:$F$5600,'07 PDR'!$A$4:$A$5600,'05 CPD'!$A20,'07 PDR'!$K$4:$K$5600,'05 CPD'!N$2))","v":""},{"$f":"IF(SUMIFS('07 PDR'!$F$4:$F$5600,'07 PDR'!$A$4:$A$5600,'05 CPD'!$A20,'07 PDR'!$K$4:$K$5600,'05 CPD'!O$2)=0,\"\",SUMIFS('07 PDR'!$F$4:$F$5600,'07 PDR'!$A$4:$A$5600,'05 CPD'!$A20,'07 PDR'!$K$4:$K$5600,'05 CPD'!O$2))","v":""},{"$f":"IF(SUMIFS('07 PDR'!$F$4:$F$5600,'07 PDR'!$A$4:$A$5600,'05 CPD'!$A20,'07 PDR'!$K$4:$K$5600,'05 CPD'!P$2)=0,\"\",SUMIFS('07 PDR'!$F$4:$F$5600,'07 PDR'!$A$4:$A$5600,'05 CPD'!$A20,'07 PDR'!$K$4:$K$5600,'05 CPD'!P$2))","v":""},{"$f":"IF(SUMIFS('07 PDR'!$F$4:$F$5600,'07 PDR'!$A$4:$A$5600,'05 CPD'!$A20,'07 PDR'!$K$4:$K$5600,'05 CPD'!Q$2)=0,\"\",SUMIFS('07 PDR'!$F$4:$F$5600,'07 PDR'!$A$4:$A$5600,'05 CPD'!$A20,'07 PDR'!$K$4:$K$5600,'05 CPD'!Q$2))","v":""},{"$f":"IF(SUMIFS('07 PDR'!$F$4:$F$5600,'07 PDR'!$A$4:$A$5600,'05 CPD'!$A20,'07 PDR'!$K$4:$K$5600,'05 CPD'!R$2)=0,\"\",SUMIFS('07 PDR'!$F$4:$F$5600,'07 PDR'!$A$4:$A$5600,'05 CPD'!$A20,'07 PDR'!$K$4:$K$5600,'05 CPD'!R$2))","v":""},null,{"$f":"IF(SUMIFS('07 PDR'!$F$4:$F$5600,'07 PDR'!$A$4:$A$5600,'05 CPD'!$A20,'07 PDR'!$L$4:$L$5600,'05 CPD'!T$2)=0,\"\",SUMIFS('07 PDR'!$F$4:$F$5600,'07 PDR'!$A$4:$A$5600,'05 CPD'!$A20,'07 PDR'!$L$4:$L$5600,'05 CPD'!T$2))","v":""},{"$f":"IF(SUMIFS('07 PDR'!$F$4:$F$5600,'07 PDR'!$A$4:$A$5600,'05 CPD'!$A20,'07 PDR'!$L$4:$L$5600,'05 CPD'!U$2)=0,\"\",SUMIFS('07 PDR'!$F$4:$F$5600,'07 PDR'!$A$4:$A$5600,'05 CPD'!$A20,'07 PDR'!$L$4:$L$5600,'05 CPD'!U$2))","v":""},{"$f":"IF(SUMIFS('07 PDR'!$F$4:$F$5600,'07 PDR'!$A$4:$A$5600,'05 CPD'!$A20,'07 PDR'!$L$4:$L$5600,'05 CPD'!V$2)=0,\"\",SUMIFS('07 PDR'!$F$4:$F$5600,'07 PDR'!$A$4:$A$5600,'05 CPD'!$A20,'07 PDR'!$L$4:$L$5600,'05 CPD'!V$2))","v":""},{"$f":"IF(SUMIFS('07 PDR'!$F$4:$F$5600,'07 PDR'!$A$4:$A$5600,'05 CPD'!$A20,'07 PDR'!$L$4:$L$5600,'05 CPD'!W$2)=0,\"\",SUMIFS('07 PDR'!$F$4:$F$5600,'07 PDR'!$A$4:$A$5600,'05 CPD'!$A20,'07 PDR'!$L$4:$L$5600,'05 CPD'!W$2))","v":""},{"$f":"IF(SUMIFS('07 PDR'!$F$4:$F$5600,'07 PDR'!$A$4:$A$5600,'05 CPD'!$A20,'07 PDR'!$L$4:$L$5600,'05 CPD'!X$2)=0,\"\",SUMIFS('07 PDR'!$F$4:$F$5600,'07 PDR'!$A$4:$A$5600,'05 CPD'!$A20,'07 PDR'!$L$4:$L$5600,'05 CPD'!X$2))","v":""},{"$f":"IF(SUMIFS('07 PDR'!$F$4:$F$5600,'07 PDR'!$A$4:$A$5600,'05 CPD'!$A20,'07 PDR'!$L$4:$L$5600,'05 CPD'!Y$2)=0,\"\",SUMIFS('07 PDR'!$F$4:$F$5600,'07 PDR'!$A$4:$A$5600,'05 CPD'!$A20,'07 PDR'!$L$4:$L$5600,'05 CPD'!Y$2))","v":""},{"$f":"IF(SUMIFS('07 PDR'!$F$4:$F$5600,'07 PDR'!$A$4:$A$5600,'05 CPD'!$A20,'07 PDR'!$L$4:$L$5600,'05 CPD'!Z$2)=0,\"\",SUMIFS('07 PDR'!$F$4:$F$5600,'07 PDR'!$A$4:$A$5600,'05 CPD'!$A20,'07 PDR'!$L$4:$L$5600,'05 CPD'!Z$2))","v":""},{"$f":"IF(SUMIFS('07 PDR'!$F$4:$F$5600,'07 PDR'!$A$4:$A$5600,'05 CPD'!$A20,'07 PDR'!$L$4:$L$5600,'05 CPD'!AA$2)=0,\"\",SUMIFS('07 PDR'!$F$4:$F$5600,'07 PDR'!$A$4:$A$5600,'05 CPD'!$A20,'07 PDR'!$L$4:$L$5600,'05 CPD'!AA$2))","v":""},{"$f":"IF(SUMIFS('07 PDR'!$F$4:$F$5600,'07 PDR'!$A$4:$A$5600,'05 CPD'!$A20,'07 PDR'!$L$4:$L$5600,'05 CPD'!AB$2)=0,\"\",SUMIFS('07 PDR'!$F$4:$F$5600,'07 PDR'!$A$4:$A$5600,'05 CPD'!$A20,'07 PDR'!$L$4:$L$5600,'05 CPD'!AB$2))","v":""},{"$f":"IF(SUMIFS('07 PDR'!$F$4:$F$5600,'07 PDR'!$A$4:$A$5600,'05 CPD'!$A20,'07 PDR'!$L$4:$L$5600,'05 CPD'!AC$2)=0,\"\",SUMIFS('07 PDR'!$F$4:$F$5600,'07 PDR'!$A$4:$A$5600,'05 CPD'!$A20,'07 PDR'!$L$4:$L$5600,'05 CPD'!AC$2))","v":""},{"$f":"IF(SUMIFS('07 PDR'!$F$4:$F$5600,'07 PDR'!$A$4:$A$5600,'05 CPD'!$A20,'07 PDR'!$L$4:$L$5600,'05 CPD'!AD$2)=0,\"\",SUMIFS('07 PDR'!$F$4:$F$5600,'07 PDR'!$A$4:$A$5600,'05 CPD'!$A20,'07 PDR'!$L$4:$L$5600,'05 CPD'!AD$2))","v":""},{"$f":"IF(SUMIFS('07 PDR'!$F$4:$F$5600,'07 PDR'!$A$4:$A$5600,'05 CPD'!$A20,'07 PDR'!$L$4:$L$5600,'05 CPD'!AE$2)=0,\"\",SUMIFS('07 PDR'!$F$4:$F$5600,'07 PDR'!$A$4:$A$5600,'05 CPD'!$A20,'07 PDR'!$L$4:$L$5600,'05 CPD'!AE$2))","v":""},{"$f":"IF(SUMIFS('07 PDR'!$F$4:$F$5600,'07 PDR'!$A$4:$A$5600,'05 CPD'!$A20,'07 PDR'!$L$4:$L$5600,'05 CPD'!AF$2)=0,\"\",SUMIFS('07 PDR'!$F$4:$F$5600,'07 PDR'!$A$4:$A$5600,'05 CPD'!$A20,'07 PDR'!$L$4:$L$5600,'05 CPD'!AF$2))","v":""}]
["<Insert Period Range for Period 19>","","","",null,null,null,{"$f":"IF(SUMIFS('07 PDR'!$F$4:$F$5600,'07 PDR'!$A$4:$A$5600,'05 CPD'!$A21,'07 PDR'!$K$4:$K$5600,'05 CPD'!H$2)=0,\"\",SUMIFS('07 PDR'!$F$4:$F$5600,'07 PDR'!$A$4:$A$5600,'05 CPD'!$A21,'07 PDR'!$K$4:$K$5600,'05 CPD'!H$2))","v":""},{"$f":"IF(SUMIFS('07 PDR'!$F$4:$F$5600,'07 PDR'!$A$4:$A$5600,'05 CPD'!$A21,'07 PDR'!$K$4:$K$5600,'05 CPD'!I$2)=0,\"\",SUMIFS('07 PDR'!$F$4:$F$5600,'07 PDR'!$A$4:$A$5600,'05 CPD'!$A21,'07 PDR'!$K$4:$K$5600,'05 CPD'!I$2))","v":""},{"$f":"IF(SUMIFS('07 PDR'!$F$4:$F$5600,'07 PDR'!$A$4:$A$5600,'05 CPD'!$A21,'07 PDR'!$K$4:$K$5600,'05 CPD'!J$2)=0,\"\",SUMIFS('07 PDR'!$F$4:$F$5600,'07 PDR'!$A$4:$A$5600,'05 CPD'!$A21,'07 PDR'!$K$4:$K$5600,'05 CPD'!J$2))","v":""},{"$f":"IF(SUMIFS('07 PDR'!$F$4:$F$5600,'07 PDR'!$A$4:$A$5600,'05 CPD'!$A21,'07 PDR'!$K$4:$K$5600,'05 CPD'!K$2)=0,\"\",SUMIFS('07 PDR'!$F$4:$F$5600,'07 PDR'!$A$4:$A$5600,'05 CPD'!$A21,'07 PDR'!$K$4:$K$5600,'05 CPD'!K$2))","v":""},{"$f":"IF(SUMIFS('07 PDR'!$F$4:$F$5600,'07 PDR'!$A$4:$A$5600,'05 CPD'!$A21,'07 PDR'!$K$4:$K$5600,'05 CPD'!L$2)=0,\"\",SUMIFS('07 PDR'!$F$4:$F$5600,'07 PDR'!$A$4:$A$5600,'05 CPD'!$A21,'07 PDR'!$K$4:$K$5600,'05 CPD'!L$2))","v":""},{"$f":"IF(SUMIFS('07 PDR'!$F$4:$F$5600,'07 PDR'!$A$4:$A$5600,'05 CPD'!$A21,'07 PDR'!$K$4:$K$5600,'05 CPD'!M$2)=0,\"\",SUMIFS('07 PDR'!$F$4:$F$5600,'07 PDR'!$A$4:$A$5600,'05 CPD'!$A21,'07 PDR'!$K$4:$K$5600,'05 CPD'!M$2))","v":""},{"$f":"IF(SUMIFS('07 PDR'!$F$4:$F$5600,'07 PDR'!$A$4:$A$5600,'05 CPD'!$A21,'07 PDR'!$K$4:$K$5600,'05 CPD'!N$2)=0,\"\",SUMIFS('07 PDR'!$F$4:$F$5600,'07 PDR'!$A$4:$A$5600,'05 CPD'!$A21,'07 PDR'!$K$4:$K$5600,'05 CPD'!N$2))","v":""},{"$f":"IF(SUMIFS('07 PDR'!$F$4:$F$5600,'07 PDR'!$A$4:$A$5600,'05 CPD'!$A21,'07 PDR'!$K$4:$K$5600,'05 CPD'!O$2)=0,\"\",SUMIFS('07 PDR'!$F$4:$F$5600,'07 PDR'!$A$4:$A$5600,'05 CPD'!$A21,'07 PDR'!$K$4:$K$5600,'05 CPD'!O$2))","v":""},{"$f":"IF(SUMIFS('07 PDR'!$F$4:$F$5600,'07 PDR'!$A$4:$A$5600,'05 CPD'!$A21,'07 PDR'!$K$4:$K$5600,'05 CPD'!P$2)=0,\"\",SUMIFS('07 PDR'!$F$4:$F$5600,'07 PDR'!$A$4:$A$5600,'05 CPD'!$A21,'07 PDR'!$K$4:$K$5600,'05 CPD'!P$2))","v":""},{"$f":"IF(SUMIFS('07 PDR'!$F$4:$F$5600,'07 PDR'!$A$4:$A$5600,'05 CPD'!$A21,'07 PDR'!$K$4:$K$5600,'05 CPD'!Q$2)=0,\"\",SUMIFS('07 PDR'!$F$4:$F$5600,'07 PDR'!$A$4:$A$5600,'05 CPD'!$A21,'07 PDR'!$K$4:$K$5600,'05 CPD'!Q$2))","v":""},{"$f":"IF(SUMIFS('07 PDR'!$F$4:$F$5600,'07 PDR'!$A$4:$A$5600,'05 CPD'!$A21,'07 PDR'!$K$4:$K$5600,'05 CPD'!R$2)=0,\"\",SUMIFS('07 PDR'!$F$4:$F$5600,'07 PDR'!$A$4:$A$5600,'05 CPD'!$A21,'07 PDR'!$K$4:$K$5600,'05 CPD'!R$2))","v":""},null,{"$f":"IF(SUMIFS('07 PDR'!$F$4:$F$5600,'07 PDR'!$A$4:$A$5600,'05 CPD'!$A21,'07 PDR'!$L$4:$L$5600,'05 CPD'!T$2)=0,\"\",SUMIFS('07 PDR'!$F$4:$F$5600,'07 PDR'!$A$4:$A$5600,'05 CPD'!$A21,'07 PDR'!$L$4:$L$5600,'05 CPD'!T$2))","v":""},{"$f":"IF(SUMIFS('07 PDR'!$F$4:$F$5600,'07 PDR'!$A$4:$A$5600,'05 CPD'!$A21,'07 PDR'!$L$4:$L$5600,'05 CPD'!U$2)=0,\"\",SUMIFS('07 PDR'!$F$4:$F$5600,'07 PDR'!$A$4:$A$5600,'05 CPD'!$A21,'07 PDR'!$L$4:$L$5600,'05 CPD'!U$2))","v":""},{"$f":"IF(SUMIFS('07 PDR'!$F$4:$F$5600,'07 PDR'!$A$4:$A$5600,'05 CPD'!$A21,'07 PDR'!$L$4:$L$5600,'05 CPD'!V$2)=0,\"\",SUMIFS('07 PDR'!$F$4:$F$5600,'07 PDR'!$A$4:$A$5600,'05 CPD'!$A21,'07 PDR'!$L$4:$L$5600,'05 CPD'!V$2))","v":""},{"$f":"IF(SUMIFS('07 PDR'!$F$4:$F$5600,'07 PDR'!$A$4:$A$5600,'05 CPD'!$A21,'07 PDR'!$L$4:$L$5600,'05 CPD'!W$2)=0,\"\",SUMIFS('07 PDR'!$F$4:$F$5600,'07 PDR'!$A$4:$A$5600,'05 CPD'!$A21,'07 PDR'!$L$4:$L$5600,'05 CPD'!W$2))","v":""},{"$f":"IF(SUMIFS('07 PDR'!$F$4:$F$5600,'07 PDR'!$A$4:$A$5600,'05 CPD'!$A21,'07 PDR'!$L$4:$L$5600,'05 CPD'!X$2)=0,\"\",SUMIFS('07 PDR'!$F$4:$F$5600,'07 PDR'!$A$4:$A$5600,'05 CPD'!$A21,'07 PDR'!$L$4:$L$5600,'05 CPD'!X$2))","v":""},{"$f":"IF(SUMIFS('07 PDR'!$F$4:$F$5600,'07 PDR'!$A$4:$A$5600,'05 CPD'!$A21,'07 PDR'!$L$4:$L$5600,'05 CPD'!Y$2)=0,\"\",SUMIFS('07 PDR'!$F$4:$F$5600,'07 PDR'!$A$4:$A$5600,'05 CPD'!$A21,'07 PDR'!$L$4:$L$5600,'05 CPD'!Y$2))","v":""},{"$f":"IF(SUMIFS('07 PDR'!$F$4:$F$5600,'07 PDR'!$A$4:$A$5600,'05 CPD'!$A21,'07 PDR'!$L$4:$L$5600,'05 CPD'!Z$2)=0,\"\",SUMIFS('07 PDR'!$F$4:$F$5600,'07 PDR'!$A$4:$A$5600,'05 CPD'!$A21,'07 PDR'!$L$4:$L$5600,'05 CPD'!Z$2))","v":""},{"$f":"IF(SUMIFS('07 PDR'!$F$4:$F$5600,'07 PDR'!$A$4:$A$5600,'05 CPD'!$A21,'07 PDR'!$L$4:$L$5600,'05 CPD'!AA$2)=0,\"\",SUMIFS('07 PDR'!$F$4:$F$5600,'07 PDR'!$A$4:$A$5600,'05 CPD'!$A21,'07 PDR'!$L$4:$L$5600,'05 CPD'!AA$2))","v":""},{"$f":"IF(SUMIFS('07 PDR'!$F$4:$F$5600,'07 PDR'!$A$4:$A$5600,'05 CPD'!$A21,'07 PDR'!$L$4:$L$5600,'05 CPD'!AB$2)=0,\"\",SUMIFS('07 PDR'!$F$4:$F$5600,'07 PDR'!$A$4:$A$5600,'05 CPD'!$A21,'07 PDR'!$L$4:$L$5600,'05 CPD'!AB$2))","v":""},{"$f":"IF(SUMIFS('07 PDR'!$F$4:$F$5600,'07 PDR'!$A$4:$A$5600,'05 CPD'!$A21,'07 PDR'!$L$4:$L$5600,'05 CPD'!AC$2)=0,\"\",SUMIFS('07 PDR'!$F$4:$F$5600,'07 PDR'!$A$4:$A$5600,'05 CPD'!$A21,'07 PDR'!$L$4:$L$5600,'05 CPD'!AC$2))","v":""},{"$f":"IF(SUMIFS('07 PDR'!$F$4:$F$5600,'07 PDR'!$A$4:$A$5600,'05 CPD'!$A21,'07 PDR'!$L$4:$L$5600,'05 CPD'!AD$2)=0,\"\",SUMIFS('07 PDR'!$F$4:$F$5600,'07 PDR'!$A$4:$A$5600,'05 CPD'!$A21,'07 PDR'!$L$4:$L$5600,'05 CPD'!AD$2))","v":""},{"$f":"IF(SUMIFS('07 PDR'!$F$4:$F$5600,'07 PDR'!$A$4:$A$5600,'05 CPD'!$A21,'07 PDR'!$L$4:$L$5600,'05 CPD'!AE$2)=0,\"\",SUMIFS('07 PDR'!$F$4:$F$5600,'07 PDR'!$A$4:$A$5600,'05 CPD'!$A21,'07 PDR'!$L$4:$L$5600,'05 CPD'!AE$2))","v":""},{"$f":"IF(SUMIFS('07 PDR'!$F$4:$F$5600,'07 PDR'!$A$4:$A$5600,'05 CPD'!$A21,'07 PDR'!$L$4:$L$5600,'05 CPD'!AF$2)=0,\"\",SUMIFS('07 PDR'!$F$4:$F$5600,'07 PDR'!$A$4:$A$5600,'05 CPD'!$A21,'07 PDR'!$L$4:$L$5600,'05 CPD'!AF$2))","v":""}]
["<Insert Period Range for Period 20>","","","",null,null,null,{"$f":"IF(SUMIFS('07 PDR'!$F$4:$F$5600,'07 PDR'!$A$4:$A$5600,'05 CPD'!$A22,'07 PDR'!$K$4:$K$5600,'05 CPD'!H$2)=0,\"\",SUMIFS('07 PDR'!$F$4:$F$5600,'07 PDR'!$A$4:$A$5600,'05 CPD'!$A22,'07 PDR'!$K$4:$K$5600,'05 CPD'!H$2))","v":""},{"$f":"IF(SUMIFS('07 PDR'!$F$4:$F$5600,'07 PDR'!$A$4:$A$5600,'05 CPD'!$A22,'07 PDR'!$K$4:$K$5600,'05 CPD'!I$2)=0,\"\",SUMIFS('07 PDR'!$F$4:$F$5600,'07 PDR'!$A$4:$A$5600,'05 CPD'!$A22,'07 PDR'!$K$4:$K$5600,'05 CPD'!I$2))","v":""},{"$f":"IF(SUMIFS('07 PDR'!$F$4:$F$5600,'07 PDR'!$A$4:$A$5600,'05 CPD'!$A22,'07 PDR'!$K$4:$K$5600,'05 CPD'!J$2)=0,\"\",SUMIFS('07 PDR'!$F$4:$F$5600,'07 PDR'!$A$4:$A$5600,'05 CPD'!$A22,'07 PDR'!$K$4:$K$5600,'05 CPD'!J$2))","v":""},{"$f":"IF(SUMIFS('07 PDR'!$F$4:$F$5600,'07 PDR'!$A$4:$A$5600,'05 CPD'!$A22,'07 PDR'!$K$4:$K$5600,'05 CPD'!K$2)=0,\"\",SUMIFS('07 PDR'!$F$4:$F$5600,'07 PDR'!$A$4:$A$5600,'05 CPD'!$A22,'07 PDR'!$K$4:$K$5600,'05 CPD'!K$2))","v":""},{"$f":"IF(SUMIFS('07 PDR'!$F$4:$F$5600,'07 PDR'!$A$4:$A$5600,'05 CPD'!$A22,'07 PDR'!$K$4:$K$5600,'05 CPD'!L$2)=0,\"\",SUMIFS('07 PDR'!$F$4:$F$5600,'07 PDR'!$A$4:$A$5600,'05 CPD'!$A22,'07 PDR'!$K$4:$K$5600,'05 CPD'!L$2))","v":""},{"$f":"IF(SUMIFS('07 PDR'!$F$4:$F$5600,'07 PDR'!$A$4:$A$5600,'05 CPD'!$A22,'07 PDR'!$K$4:$K$5600,'05 CPD'!M$2)=0,\"\",SUMIFS('07 PDR'!$F$4:$F$5600,'07 PDR'!$A$4:$A$5600,'05 CPD'!$A22,'07 PDR'!$K$4:$K$5600,'05 CPD'!M$2))","v":""},{"$f":"IF(SUMIFS('07 PDR'!$F$4:$F$5600,'07 PDR'!$A$4:$A$5600,'05 CPD'!$A22,'07 PDR'!$K$4:$K$5600,'05 CPD'!N$2)=0,\"\",SUMIFS('07 PDR'!$F$4:$F$5600,'07 PDR'!$A$4:$A$5600,'05 CPD'!$A22,'07 PDR'!$K$4:$K$5600,'05 CPD'!N$2))","v":""},{"$f":"IF(SUMIFS('07 PDR'!$F$4:$F$5600,'07 PDR'!$A$4:$A$5600,'05 CPD'!$A22,'07 PDR'!$K$4:$K$5600,'05 CPD'!O$2)=0,\"\",SUMIFS('07 PDR'!$F$4:$F$5600,'07 PDR'!$A$4:$A$5600,'05 CPD'!$A22,'07 PDR'!$K$4:$K$5600,'05 CPD'!O$2))","v":""},{"$f":"IF(SUMIFS('07 PDR'!$F$4:$F$5600,'07 PDR'!$A$4:$A$5600,'05 CPD'!$A22,'07 PDR'!$K$4:$K$5600,'05 CPD'!P$2)=0,\"\",SUMIFS('07 PDR'!$F$4:$F$5600,'07 PDR'!$A$4:$A$5600,'05 CPD'!$A22,'07 PDR'!$K$4:$K$5600,'05 CPD'!P$2))","v":""},{"$f":"IF(SUMIFS('07 PDR'!$F$4:$F$5600,'07 PDR'!$A$4:$A$5600,'05 CPD'!$A22,'07 PDR'!$K$4:$K$5600,'05 CPD'!Q$2)=0,\"\",SUMIFS('07 PDR'!$F$4:$F$5600,'07 PDR'!$A$4:$A$5600,'05 CPD'!$A22,'07 PDR'!$K$4:$K$5600,'05 CPD'!Q$2))","v":""},{"$f":"IF(SUMIFS('07 PDR'!$F$4:$F$5600,'07 PDR'!$A$4:$A$5600,'05 CPD'!$A22,'07 PDR'!$K$4:$K$5600,'05 CPD'!R$2)=0,\"\",SUMIFS('07 PDR'!$F$4:$F$5600,'07 PDR'!$A$4:$A$5600,'05 CPD'!$A22,'07 PDR'!$K$4:$K$5600,'05 CPD'!R$2))","v":""},null,{"$f":"IF(SUMIFS('07 PDR'!$F$4:$F$5600,'07 PDR'!$A$4:$A$5600,'05 CPD'!$A22,'07 PDR'!$L$4:$L$5600,'05 CPD'!T$2)=0,\"\",SUMIFS('07 PDR'!$F$4:$F$5600,'07 PDR'!$A$4:$A$5600,'05 CPD'!$A22,'07 PDR'!$L$4:$L$5600,'05 CPD'!T$2))","v":""},{"$f":"IF(SUMIFS('07 PDR'!$F$4:$F$5600,'07 PDR'!$A$4:$A$5600,'05 CPD'!$A22,'07 PDR'!$L$4:$L$5600,'05 CPD'!U$2)=0,\"\",SUMIFS('07 PDR'!$F$4:$F$5600,'07 PDR'!$A$4:$A$5600,'05 CPD'!$A22,'07 PDR'!$L$4:$L$5600,'05 CPD'!U$2))","v":""},{"$f":"IF(SUMIFS('07 PDR'!$F$4:$F$5600,'07 PDR'!$A$4:$A$5600,'05 CPD'!$A22,'07 PDR'!$L$4:$L$5600,'05 CPD'!V$2)=0,\"\",SUMIFS('07 PDR'!$F$4:$F$5600,'07 PDR'!$A$4:$A$5600,'05 CPD'!$A22,'07 PDR'!$L$4:$L$5600,'05 CPD'!V$2))","v":""},{"$f":"IF(SUMIFS('07 PDR'!$F$4:$F$5600,'07 PDR'!$A$4:$A$5600,'05 CPD'!$A22,'07 PDR'!$L$4:$L$5600,'05 CPD'!W$2)=0,\"\",SUMIFS('07 PDR'!$F$4:$F$5600,'07 PDR'!$A$4:$A$5600,'05 CPD'!$A22,'07 PDR'!$L$4:$L$5600,'05 CPD'!W$2))","v":""},{"$f":"IF(SUMIFS('07 PDR'!$F$4:$F$5600,'07 PDR'!$A$4:$A$5600,'05 CPD'!$A22,'07 PDR'!$L$4:$L$5600,'05 CPD'!X$2)=0,\"\",SUMIFS('07 PDR'!$F$4:$F$5600,'07 PDR'!$A$4:$A$5600,'05 CPD'!$A22,'07 PDR'!$L$4:$L$5600,'05 CPD'!X$2))","v":""},{"$f":"IF(SUMIFS('07 PDR'!$F$4:$F$5600,'07 PDR'!$A$4:$A$5600,'05 CPD'!$A22,'07 PDR'!$L$4:$L$5600,'05 CPD'!Y$2)=0,\"\",SUMIFS('07 PDR'!$F$4:$F$5600,'07 PDR'!$A$4:$A$5600,'05 CPD'!$A22,'07 PDR'!$L$4:$L$5600,'05 CPD'!Y$2))","v":""},{"$f":"IF(SUMIFS('07 PDR'!$F$4:$F$5600,'07 PDR'!$A$4:$A$5600,'05 CPD'!$A22,'07 PDR'!$L$4:$L$5600,'05 CPD'!Z$2)=0,\"\",SUMIFS('07 PDR'!$F$4:$F$5600,'07 PDR'!$A$4:$A$5600,'05 CPD'!$A22,'07 PDR'!$L$4:$L$5600,'05 CPD'!Z$2))","v":""},{"$f":"IF(SUMIFS('07 PDR'!$F$4:$F$5600,'07 PDR'!$A$4:$A$5600,'05 CPD'!$A22,'07 PDR'!$L$4:$L$5600,'05 CPD'!AA$2)=0,\"\",SUMIFS('07 PDR'!$F$4:$F$5600,'07 PDR'!$A$4:$A$5600,'05 CPD'!$A22,'07 PDR'!$L$4:$L$5600,'05 CPD'!AA$2))","v":""},{"$f":"IF(SUMIFS('07 PDR'!$F$4:$F$5600,'07 PDR'!$A$4:$A$5600,'05 CPD'!$A22,'07 PDR'!$L$4:$L$5600,'05 CPD'!AB$2)=0,\"\",SUMIFS('07 PDR'!$F$4:$F$5600,'07 PDR'!$A$4:$A$5600,'05 CPD'!$A22,'07 PDR'!$L$4:$L$5600,'05 CPD'!AB$2))","v":""},{"$f":"IF(SUMIFS('07 PDR'!$F$4:$F$5600,'07 PDR'!$A$4:$A$5600,'05 CPD'!$A22,'07 PDR'!$L$4:$L$5600,'05 CPD'!AC$2)=0,\"\",SUMIFS('07 PDR'!$F$4:$F$5600,'07 PDR'!$A$4:$A$5600,'05 CPD'!$A22,'07 PDR'!$L$4:$L$5600,'05 CPD'!AC$2))","v":""},{"$f":"IF(SUMIFS('07 PDR'!$F$4:$F$5600,'07 PDR'!$A$4:$A$5600,'05 CPD'!$A22,'07 PDR'!$L$4:$L$5600,'05 CPD'!AD$2)=0,\"\",SUMIFS('07 PDR'!$F$4:$F$5600,'07 PDR'!$A$4:$A$5600,'05 CPD'!$A22,'07 PDR'!$L$4:$L$5600,'05 CPD'!AD$2))","v":""},{"$f":"IF(SUMIFS('07 PDR'!$F$4:$F$5600,'07 PDR'!$A$4:$A$5600,'05 CPD'!$A22,'07 PDR'!$L$4:$L$5600,'05 CPD'!AE$2)=0,\"\",SUMIFS('07 PDR'!$F$4:$F$5600,'07 PDR'!$A$4:$A$5600,'05 CPD'!$A22,'07 PDR'!$L$4:$L$5600,'05 CPD'!AE$2))","v":""},{"$f":"IF(SUMIFS('07 PDR'!$F$4:$F$5600,'07 PDR'!$A$4:$A$5600,'05 CPD'!$A22,'07 PDR'!$L$4:$L$5600,'05 CPD'!AF$2)=0,\"\",SUMIFS('07 PDR'!$F$4:$F$5600,'07 PDR'!$A$4:$A$5600,'05 CPD'!$A22,'07 PDR'!$L$4:$L$5600,'05 CPD'!AF$2))","v":""}]
["<Insert Period Range for Period 21>","","","",null,null,null,{"$f":"IF(SUMIFS('07 PDR'!$F$4:$F$5600,'07 PDR'!$A$4:$A$5600,'05 CPD'!$A23,'07 PDR'!$K$4:$K$5600,'05 CPD'!H$2)=0,\"\",SUMIFS('07 PDR'!$F$4:$F$5600,'07 PDR'!$A$4:$A$5600,'05 CPD'!$A23,'07 PDR'!$K$4:$K$5600,'05 CPD'!H$2))","v":""},{"$f":"IF(SUMIFS('07 PDR'!$F$4:$F$5600,'07 PDR'!$A$4:$A$5600,'05 CPD'!$A23,'07 PDR'!$K$4:$K$5600,'05 CPD'!I$2)=0,\"\",SUMIFS('07 PDR'!$F$4:$F$5600,'07 PDR'!$A$4:$A$5600,'05 CPD'!$A23,'07 PDR'!$K$4:$K$5600,'05 CPD'!I$2))","v":""},{"$f":"IF(SUMIFS('07 PDR'!$F$4:$F$5600,'07 PDR'!$A$4:$A$5600,'05 CPD'!$A23,'07 PDR'!$K$4:$K$5600,'05 CPD'!J$2)=0,\"\",SUMIFS('07 PDR'!$F$4:$F$5600,'07 PDR'!$A$4:$A$5600,'05 CPD'!$A23,'07 PDR'!$K$4:$K$5600,'05 CPD'!J$2))","v":""},{"$f":"IF(SUMIFS('07 PDR'!$F$4:$F$5600,'07 PDR'!$A$4:$A$5600,'05 CPD'!$A23,'07 PDR'!$K$4:$K$5600,'05 CPD'!K$2)=0,\"\",SUMIFS('07 PDR'!$F$4:$F$5600,'07 PDR'!$A$4:$A$5600,'05 CPD'!$A23,'07 PDR'!$K$4:$K$5600,'05 CPD'!K$2))","v":""},{"$f":"IF(SUMIFS('07 PDR'!$F$4:$F$5600,'07 PDR'!$A$4:$A$5600,'05 CPD'!$A23,'07 PDR'!$K$4:$K$5600,'05 CPD'!L$2)=0,\"\",SUMIFS('07 PDR'!$F$4:$F$5600,'07 PDR'!$A$4:$A$5600,'05 CPD'!$A23,'07 PDR'!$K$4:$K$5600,'05 CPD'!L$2))","v":""},{"$f":"IF(SUMIFS('07 PDR'!$F$4:$F$5600,'07 PDR'!$A$4:$A$5600,'05 CPD'!$A23,'07 PDR'!$K$4:$K$5600,'05 CPD'!M$2)=0,\"\",SUMIFS('07 PDR'!$F$4:$F$5600,'07 PDR'!$A$4:$A$5600,'05 CPD'!$A23,'07 PDR'!$K$4:$K$5600,'05 CPD'!M$2))","v":""},{"$f":"IF(SUMIFS('07 PDR'!$F$4:$F$5600,'07 PDR'!$A$4:$A$5600,'05 CPD'!$A23,'07 PDR'!$K$4:$K$5600,'05 CPD'!N$2)=0,\"\",SUMIFS('07 PDR'!$F$4:$F$5600,'07 PDR'!$A$4:$A$5600,'05 CPD'!$A23,'07 PDR'!$K$4:$K$5600,'05 CPD'!N$2))","v":""},{"$f":"IF(SUMIFS('07 PDR'!$F$4:$F$5600,'07 PDR'!$A$4:$A$5600,'05 CPD'!$A23,'07 PDR'!$K$4:$K$5600,'05 CPD'!O$2)=0,\"\",SUMIFS('07 PDR'!$F$4:$F$5600,'07 PDR'!$A$4:$A$5600,'05 CPD'!$A23,'07 PDR'!$K$4:$K$5600,'05 CPD'!O$2))","v":""},{"$f":"IF(SUMIFS('07 PDR'!$F$4:$F$5600,'07 PDR'!$A$4:$A$5600,'05 CPD'!$A23,'07 PDR'!$K$4:$K$5600,'05 CPD'!P$2)=0,\"\",SUMIFS('07 PDR'!$F$4:$F$5600,'07 PDR'!$A$4:$A$5600,'05 CPD'!$A23,'07 PDR'!$K$4:$K$5600,'05 CPD'!P$2))","v":""},{"$f":"IF(SUMIFS('07 PDR'!$F$4:$F$5600,'07 PDR'!$A$4:$A$5600,'05 CPD'!$A23,'07 PDR'!$K$4:$K$5600,'05 CPD'!Q$2)=0,\"\",SUMIFS('07 PDR'!$F$4:$F$5600,'07 PDR'!$A$4:$A$5600,'05 CPD'!$A23,'07 PDR'!$K$4:$K$5600,'05 CPD'!Q$2))","v":""},{"$f":"IF(SUMIFS('07 PDR'!$F$4:$F$5600,'07 PDR'!$A$4:$A$5600,'05 CPD'!$A23,'07 PDR'!$K$4:$K$5600,'05 CPD'!R$2)=0,\"\",SUMIFS('07 PDR'!$F$4:$F$5600,'07 PDR'!$A$4:$A$5600,'05 CPD'!$A23,'07 PDR'!$K$4:$K$5600,'05 CPD'!R$2))","v":""},null,{"$f":"IF(SUMIFS('07 PDR'!$F$4:$F$5600,'07 PDR'!$A$4:$A$5600,'05 CPD'!$A23,'07 PDR'!$L$4:$L$5600,'05 CPD'!T$2)=0,\"\",SUMIFS('07 PDR'!$F$4:$F$5600,'07 PDR'!$A$4:$A$5600,'05 CPD'!$A23,'07 PDR'!$L$4:$L$5600,'05 CPD'!T$2))","v":""},{"$f":"IF(SUMIFS('07 PDR'!$F$4:$F$5600,'07 PDR'!$A$4:$A$5600,'05 CPD'!$A23,'07 PDR'!$L$4:$L$5600,'05 CPD'!U$2)=0,\"\",SUMIFS('07 PDR'!$F$4:$F$5600,'07 PDR'!$A$4:$A$5600,'05 CPD'!$A23,'07 PDR'!$L$4:$L$5600,'05 CPD'!U$2))","v":""},{"$f":"IF(SUMIFS('07 PDR'!$F$4:$F$5600,'07 PDR'!$A$4:$A$5600,'05 CPD'!$A23,'07 PDR'!$L$4:$L$5600,'05 CPD'!V$2)=0,\"\",SUMIFS('07 PDR'!$F$4:$F$5600,'07 PDR'!$A$4:$A$5600,'05 CPD'!$A23,'07 PDR'!$L$4:$L$5600,'05 CPD'!V$2))","v":""},{"$f":"IF(SUMIFS('07 PDR'!$F$4:$F$5600,'07 PDR'!$A$4:$A$5600,'05 CPD'!$A23,'07 PDR'!$L$4:$L$5600,'05 CPD'!W$2)=0,\"\",SUMIFS('07 PDR'!$F$4:$F$5600,'07 PDR'!$A$4:$A$5600,'05 CPD'!$A23,'07 PDR'!$L$4:$L$5600,'05 CPD'!W$2))","v":""},{"$f":"IF(SUMIFS('07 PDR'!$F$4:$F$5600,'07 PDR'!$A$4:$A$5600,'05 CPD'!$A23,'07 PDR'!$L$4:$L$5600,'05 CPD'!X$2)=0,\"\",SUMIFS('07 PDR'!$F$4:$F$5600,'07 PDR'!$A$4:$A$5600,'05 CPD'!$A23,'07 PDR'!$L$4:$L$5600,'05 CPD'!X$2))","v":""},{"$f":"IF(SUMIFS('07 PDR'!$F$4:$F$5600,'07 PDR'!$A$4:$A$5600,'05 CPD'!$A23,'07 PDR'!$L$4:$L$5600,'05 CPD'!Y$2)=0,\"\",SUMIFS('07 PDR'!$F$4:$F$5600,'07 PDR'!$A$4:$A$5600,'05 CPD'!$A23,'07 PDR'!$L$4:$L$5600,'05 CPD'!Y$2))","v":""},{"$f":"IF(SUMIFS('07 PDR'!$F$4:$F$5600,'07 PDR'!$A$4:$A$5600,'05 CPD'!$A23,'07 PDR'!$L$4:$L$5600,'05 CPD'!Z$2)=0,\"\",SUMIFS('07 PDR'!$F$4:$F$5600,'07 PDR'!$A$4:$A$5600,'05 CPD'!$A23,'07 PDR'!$L$4:$L$5600,'05 CPD'!Z$2))","v":""},{"$f":"IF(SUMIFS('07 PDR'!$F$4:$F$5600,'07 PDR'!$A$4:$A$5600,'05 CPD'!$A23,'07 PDR'!$L$4:$L$5600,'05 CPD'!AA$2)=0,\"\",SUMIFS('07 PDR'!$F$4:$F$5600,'07 PDR'!$A$4:$A$5600,'05 CPD'!$A23,'07 PDR'!$L$4:$L$5600,'05 CPD'!AA$2))","v":""},{"$f":"IF(SUMIFS('07 PDR'!$F$4:$F$5600,'07 PDR'!$A$4:$A$5600,'05 CPD'!$A23,'07 PDR'!$L$4:$L$5600,'05 CPD'!AB$2)=0,\"\",SUMIFS('07 PDR'!$F$4:$F$5600,'07 PDR'!$A$4:$A$5600,'05 CPD'!$A23,'07 PDR'!$L$4:$L$5600,'05 CPD'!AB$2))","v":""},{"$f":"IF(SUMIFS('07 PDR'!$F$4:$F$5600,'07 PDR'!$A$4:$A$5600,'05 CPD'!$A23,'07 PDR'!$L$4:$L$5600,'05 CPD'!AC$2)=0,\"\",SUMIFS('07 PDR'!$F$4:$F$5600,'07 PDR'!$A$4:$A$5600,'05 CPD'!$A23,'07 PDR'!$L$4:$L$5600,'05 CPD'!AC$2))","v":""},{"$f":"IF(SUMIFS('07 PDR'!$F$4:$F$5600,'07 PDR'!$A$4:$A$5600,'05 CPD'!$A23,'07 PDR'!$L$4:$L$5600,'05 CPD'!AD$2)=0,\"\",SUMIFS('07 PDR'!$F$4:$F$5600,'07 PDR'!$A$4:$A$5600,'05 CPD'!$A23,'07 PDR'!$L$4:$L$5600,'05 CPD'!AD$2))","v":""},{"$f":"IF(SUMIFS('07 PDR'!$F$4:$F$5600,'07 PDR'!$A$4:$A$5600,'05 CPD'!$A23,'07 PDR'!$L$4:$L$5600,'05 CPD'!AE$2)=0,\"\",SUMIFS('07 PDR'!$F$4:$F$5600,'07 PDR'!$A$4:$A$5600,'05 CPD'!$A23,'07 PDR'!$L$4:$L$5600,'05 CPD'!AE$2))","v":""},{"$f":"IF(SUMIFS('07 PDR'!$F$4:$F$5600,'07 PDR'!$A$4:$A$5600,'05 CPD'!$A23,'07 PDR'!$L$4:$L$5600,'05 CPD'!AF$2)=0,\"\",SUMIFS('07 PDR'!$F$4:$F$5600,'07 PDR'!$A$4:$A$5600,'05 CPD'!$A23,'07 PDR'!$L$4:$L$5600,'05 CPD'!AF$2))","v":""}]
["<Insert Period Range for Period 22>","","","",null,null,null,{"$f":"IF(SUMIFS('07 PDR'!$F$4:$F$5600,'07 PDR'!$A$4:$A$5600,'05 CPD'!$A24,'07 PDR'!$K$4:$K$5600,'05 CPD'!H$2)=0,\"\",SUMIFS('07 PDR'!$F$4:$F$5600,'07 PDR'!$A$4:$A$5600,'05 CPD'!$A24,'07 PDR'!$K$4:$K$5600,'05 CPD'!H$2))","v":""},{"$f":"IF(SUMIFS('07 PDR'!$F$4:$F$5600,'07 PDR'!$A$4:$A$5600,'05 CPD'!$A24,'07 PDR'!$K$4:$K$5600,'05 CPD'!I$2)=0,\"\",SUMIFS('07 PDR'!$F$4:$F$5600,'07 PDR'!$A$4:$A$5600,'05 CPD'!$A24,'07 PDR'!$K$4:$K$5600,'05 CPD'!I$2))","v":""},{"$f":"IF(SUMIFS('07 PDR'!$F$4:$F$5600,'07 PDR'!$A$4:$A$5600,'05 CPD'!$A24,'07 PDR'!$K$4:$K$5600,'05 CPD'!J$2)=0,\"\",SUMIFS('07 PDR'!$F$4:$F$5600,'07 PDR'!$A$4:$A$5600,'05 CPD'!$A24,'07 PDR'!$K$4:$K$5600,'05 CPD'!J$2))","v":""},{"$f":"IF(SUMIFS('07 PDR'!$F$4:$F$5600,'07 PDR'!$A$4:$A$5600,'05 CPD'!$A24,'07 PDR'!$K$4:$K$5600,'05 CPD'!K$2)=0,\"\",SUMIFS('07 PDR'!$F$4:$F$5600,'07 PDR'!$A$4:$A$5600,'05 CPD'!$A24,'07 PDR'!$K$4:$K$5600,'05 CPD'!K$2))","v":""},{"$f":"IF(SUMIFS('07 PDR'!$F$4:$F$5600,'07 PDR'!$A$4:$A$5600,'05 CPD'!$A24,'07 PDR'!$K$4:$K$5600,'05 CPD'!L$2)=0,\"\",SUMIFS('07 PDR'!$F$4:$F$5600,'07 PDR'!$A$4:$A$5600,'05 CPD'!$A24,'07 PDR'!$K$4:$K$5600,'05 CPD'!L$2))","v":""},{"$f":"IF(SUMIFS('07 PDR'!$F$4:$F$5600,'07 PDR'!$A$4:$A$5600,'05 CPD'!$A24,'07 PDR'!$K$4:$K$5600,'05 CPD'!M$2)=0,\"\",SUMIFS('07 PDR'!$F$4:$F$5600,'07 PDR'!$A$4:$A$5600,'05 CPD'!$A24,'07 PDR'!$K$4:$K$5600,'05 CPD'!M$2))","v":""},{"$f":"IF(SUMIFS('07 PDR'!$F$4:$F$5600,'07 PDR'!$A$4:$A$5600,'05 CPD'!$A24,'07 PDR'!$K$4:$K$5600,'05 CPD'!N$2)=0,\"\",SUMIFS('07 PDR'!$F$4:$F$5600,'07 PDR'!$A$4:$A$5600,'05 CPD'!$A24,'07 PDR'!$K$4:$K$5600,'05 CPD'!N$2))","v":""},{"$f":"IF(SUMIFS('07 PDR'!$F$4:$F$5600,'07 PDR'!$A$4:$A$5600,'05 CPD'!$A24,'07 PDR'!$K$4:$K$5600,'05 CPD'!O$2)=0,\"\",SUMIFS('07 PDR'!$F$4:$F$5600,'07 PDR'!$A$4:$A$5600,'05 CPD'!$A24,'07 PDR'!$K$4:$K$5600,'05 CPD'!O$2))","v":""},{"$f":"IF(SUMIFS('07 PDR'!$F$4:$F$5600,'07 PDR'!$A$4:$A$5600,'05 CPD'!$A24,'07 PDR'!$K$4:$K$5600,'05 CPD'!P$2)=0,\"\",SUMIFS('07 PDR'!$F$4:$F$5600,'07 PDR'!$A$4:$A$5600,'05 CPD'!$A24,'07 PDR'!$K$4:$K$5600,'05 CPD'!P$2))","v":""},{"$f":"IF(SUMIFS('07 PDR'!$F$4:$F$5600,'07 PDR'!$A$4:$A$5600,'05 CPD'!$A24,'07 PDR'!$K$4:$K$5600,'05 CPD'!Q$2)=0,\"\",SUMIFS('07 PDR'!$F$4:$F$5600,'07 PDR'!$A$4:$A$5600,'05 CPD'!$A24,'07 PDR'!$K$4:$K$5600,'05 CPD'!Q$2))","v":""},{"$f":"IF(SUMIFS('07 PDR'!$F$4:$F$5600,'07 PDR'!$A$4:$A$5600,'05 CPD'!$A24,'07 PDR'!$K$4:$K$5600,'05 CPD'!R$2)=0,\"\",SUMIFS('07 PDR'!$F$4:$F$5600,'07 PDR'!$A$4:$A$5600,'05 CPD'!$A24,'07 PDR'!$K$4:$K$5600,'05 CPD'!R$2))","v":""},null,{"$f":"IF(SUMIFS('07 PDR'!$F$4:$F$5600,'07 PDR'!$A$4:$A$5600,'05 CPD'!$A24,'07 PDR'!$L$4:$L$5600,'05 CPD'!T$2)=0,\"\",SUMIFS('07 PDR'!$F$4:$F$5600,'07 PDR'!$A$4:$A$5600,'05 CPD'!$A24,'07 PDR'!$L$4:$L$5600,'05 CPD'!T$2))","v":""},{"$f":"IF(SUMIFS('07 PDR'!$F$4:$F$5600,'07 PDR'!$A$4:$A$5600,'05 CPD'!$A24,'07 PDR'!$L$4:$L$5600,'05 CPD'!U$2)=0,\"\",SUMIFS('07 PDR'!$F$4:$F$5600,'07 PDR'!$A$4:$A$5600,'05 CPD'!$A24,'07 PDR'!$L$4:$L$5600,'05 CPD'!U$2))","v":""},{"$f":"IF(SUMIFS('07 PDR'!$F$4:$F$5600,'07 PDR'!$A$4:$A$5600,'05 CPD'!$A24,'07 PDR'!$L$4:$L$5600,'05 CPD'!V$2)=0,\"\",SUMIFS('07 PDR'!$F$4:$F$5600,'07 PDR'!$A$4:$A$5600,'05 CPD'!$A24,'07 PDR'!$L$4:$L$5600,'05 CPD'!V$2))","v":""},{"$f":"IF(SUMIFS('07 PDR'!$F$4:$F$5600,'07 PDR'!$A$4:$A$5600,'05 CPD'!$A24,'07 PDR'!$L$4:$L$5600,'05 CPD'!W$2)=0,\"\",SUMIFS('07 PDR'!$F$4:$F$5600,'07 PDR'!$A$4:$A$5600,'05 CPD'!$A24,'07 PDR'!$L$4:$L$5600,'05 CPD'!W$2))","v":""},{"$f":"IF(SUMIFS('07 PDR'!$F$4:$F$5600,'07 PDR'!$A$4:$A$5600,'05 CPD'!$A24,'07 PDR'!$L$4:$L$5600,'05 CPD'!X$2)=0,\"\",SUMIFS('07 PDR'!$F$4:$F$5600,'07 PDR'!$A$4:$A$5600,'05 CPD'!$A24,'07 PDR'!$L$4:$L$5600,'05 CPD'!X$2))","v":""},{"$f":"IF(SUMIFS('07 PDR'!$F$4:$F$5600,'07 PDR'!$A$4:$A$5600,'05 CPD'!$A24,'07 PDR'!$L$4:$L$5600,'05 CPD'!Y$2)=0,\"\",SUMIFS('07 PDR'!$F$4:$F$5600,'07 PDR'!$A$4:$A$5600,'05 CPD'!$A24,'07 PDR'!$L$4:$L$5600,'05 CPD'!Y$2))","v":""},{"$f":"IF(SUMIFS('07 PDR'!$F$4:$F$5600,'07 PDR'!$A$4:$A$5600,'05 CPD'!$A24,'07 PDR'!$L$4:$L$5600,'05 CPD'!Z$2)=0,\"\",SUMIFS('07 PDR'!$F$4:$F$5600,'07 PDR'!$A$4:$A$5600,'05 CPD'!$A24,'07 PDR'!$L$4:$L$5600,'05 CPD'!Z$2))","v":""},{"$f":"IF(SUMIFS('07 PDR'!$F$4:$F$5600,'07 PDR'!$A$4:$A$5600,'05 CPD'!$A24,'07 PDR'!$L$4:$L$5600,'05 CPD'!AA$2)=0,\"\",SUMIFS('07 PDR'!$F$4:$F$5600,'07 PDR'!$A$4:$A$5600,'05 CPD'!$A24,'07 PDR'!$L$4:$L$5600,'05 CPD'!AA$2))","v":""},{"$f":"IF(SUMIFS('07 PDR'!$F$4:$F$5600,'07 PDR'!$A$4:$A$5600,'05 CPD'!$A24,'07 PDR'!$L$4:$L$5600,'05 CPD'!AB$2)=0,\"\",SUMIFS('07 PDR'!$F$4:$F$5600,'07 PDR'!$A$4:$A$5600,'05 CPD'!$A24,'07 PDR'!$L$4:$L$5600,'05 CPD'!AB$2))","v":""},{"$f":"IF(SUMIFS('07 PDR'!$F$4:$F$5600,'07 PDR'!$A$4:$A$5600,'05 CPD'!$A24,'07 PDR'!$L$4:$L$5600,'05 CPD'!AC$2)=0,\"\",SUMIFS('07 PDR'!$F$4:$F$5600,'07 PDR'!$A$4:$A$5600,'05 CPD'!$A24,'07 PDR'!$L$4:$L$5600,'05 CPD'!AC$2))","v":""},{"$f":"IF(SUMIFS('07 PDR'!$F$4:$F$5600,'07 PDR'!$A$4:$A$5600,'05 CPD'!$A24,'07 PDR'!$L$4:$L$5600,'05 CPD'!AD$2)=0,\"\",SUMIFS('07 PDR'!$F$4:$F$5600,'07 PDR'!$A$4:$A$5600,'05 CPD'!$A24,'07 PDR'!$L$4:$L$5600,'05 CPD'!AD$2))","v":""},{"$f":"IF(SUMIFS('07 PDR'!$F$4:$F$5600,'07 PDR'!$A$4:$A$5600,'05 CPD'!$A24,'07 PDR'!$L$4:$L$5600,'05 CPD'!AE$2)=0,\"\",SUMIFS('07 PDR'!$F$4:$F$5600,'07 PDR'!$A$4:$A$5600,'05 CPD'!$A24,'07 PDR'!$L$4:$L$5600,'05 CPD'!AE$2))","v":""},{"$f":"IF(SUMIFS('07 PDR'!$F$4:$F$5600,'07 PDR'!$A$4:$A$5600,'05 CPD'!$A24,'07 PDR'!$L$4:$L$5600,'05 CPD'!AF$2)=0,\"\",SUMIFS('07 PDR'!$F$4:$F$5600,'07 PDR'!$A$4:$A$5600,'05 CPD'!$A24,'07 PDR'!$L$4:$L$5600,'05 CPD'!AF$2))","v":""}]
["<Insert Period Range for Period 23>","","","",null,null,null,{"$f":"IF(SUMIFS('07 PDR'!$F$4:$F$5600,'07 PDR'!$A$4:$A$5600,'05 CPD'!$A25,'07 PDR'!$K$4:$K$5600,'05 CPD'!H$2)=0,\"\",SUMIFS('07 PDR'!$F$4:$F$5600,'07 PDR'!$A$4:$A$5600,'05 CPD'!$A25,'07 PDR'!$K$4:$K$5600,'05 CPD'!H$2))","v":""},{"$f":"IF(SUMIFS('07 PDR'!$F$4:$F$5600,'07 PDR'!$A$4:$A$5600,'05 CPD'!$A25,'07 PDR'!$K$4:$K$5600,'05 CPD'!I$2)=0,\"\",SUMIFS('07 PDR'!$F$4:$F$5600,'07 PDR'!$A$4:$A$5600,'05 CPD'!$A25,'07 PDR'!$K$4:$K$5600,'05 CPD'!I$2))","v":""},{"$f":"IF(SUMIFS('07 PDR'!$F$4:$F$5600,'07 PDR'!$A$4:$A$5600,'05 CPD'!$A25,'07 PDR'!$K$4:$K$5600,'05 CPD'!J$2)=0,\"\",SUMIFS('07 PDR'!$F$4:$F$5600,'07 PDR'!$A$4:$A$5600,'05 CPD'!$A25,'07 PDR'!$K$4:$K$5600,'05 CPD'!J$2))","v":""},{"$f":"IF(SUMIFS('07 PDR'!$F$4:$F$5600,'07 PDR'!$A$4:$A$5600,'05 CPD'!$A25,'07 PDR'!$K$4:$K$5600,'05 CPD'!K$2)=0,\"\",SUMIFS('07 PDR'!$F$4:$F$5600,'07 PDR'!$A$4:$A$5600,'05 CPD'!$A25,'07 PDR'!$K$4:$K$5600,'05 CPD'!K$2))","v":""},{"$f":"IF(SUMIFS('07 PDR'!$F$4:$F$5600,'07 PDR'!$A$4:$A$5600,'05 CPD'!$A25,'07 PDR'!$K$4:$K$5600,'05 CPD'!L$2)=0,\"\",SUMIFS('07 PDR'!$F$4:$F$5600,'07 PDR'!$A$4:$A$5600,'05 CPD'!$A25,'07 PDR'!$K$4:$K$5600,'05 CPD'!L$2))","v":""},{"$f":"IF(SUMIFS('07 PDR'!$F$4:$F$5600,'07 PDR'!$A$4:$A$5600,'05 CPD'!$A25,'07 PDR'!$K$4:$K$5600,'05 CPD'!M$2)=0,\"\",SUMIFS('07 PDR'!$F$4:$F$5600,'07 PDR'!$A$4:$A$5600,'05 CPD'!$A25,'07 PDR'!$K$4:$K$5600,'05 CPD'!M$2))","v":""},{"$f":"IF(SUMIFS('07 PDR'!$F$4:$F$5600,'07 PDR'!$A$4:$A$5600,'05 CPD'!$A25,'07 PDR'!$K$4:$K$5600,'05 CPD'!N$2)=0,\"\",SUMIFS('07 PDR'!$F$4:$F$5600,'07 PDR'!$A$4:$A$5600,'05 CPD'!$A25,'07 PDR'!$K$4:$K$5600,'05 CPD'!N$2))","v":""},{"$f":"IF(SUMIFS('07 PDR'!$F$4:$F$5600,'07 PDR'!$A$4:$A$5600,'05 CPD'!$A25,'07 PDR'!$K$4:$K$5600,'05 CPD'!O$2)=0,\"\",SUMIFS('07 PDR'!$F$4:$F$5600,'07 PDR'!$A$4:$A$5600,'05 CPD'!$A25,'07 PDR'!$K$4:$K$5600,'05 CPD'!O$2))","v":""},{"$f":"IF(SUMIFS('07 PDR'!$F$4:$F$5600,'07 PDR'!$A$4:$A$5600,'05 CPD'!$A25,'07 PDR'!$K$4:$K$5600,'05 CPD'!P$2)=0,\"\",SUMIFS('07 PDR'!$F$4:$F$5600,'07 PDR'!$A$4:$A$5600,'05 CPD'!$A25,'07 PDR'!$K$4:$K$5600,'05 CPD'!P$2))","v":""},{"$f":"IF(SUMIFS('07 PDR'!$F$4:$F$5600,'07 PDR'!$A$4:$A$5600,'05 CPD'!$A25,'07 PDR'!$K$4:$K$5600,'05 CPD'!Q$2)=0,\"\",SUMIFS('07 PDR'!$F$4:$F$5600,'07 PDR'!$A$4:$A$5600,'05 CPD'!$A25,'07 PDR'!$K$4:$K$5600,'05 CPD'!Q$2))","v":""},{"$f":"IF(SUMIFS('07 PDR'!$F$4:$F$5600,'07 PDR'!$A$4:$A$5600,'05 CPD'!$A25,'07 PDR'!$K$4:$K$5600,'05 CPD'!R$2)=0,\"\",SUMIFS('07 PDR'!$F$4:$F$5600,'07 PDR'!$A$4:$A$5600,'05 CPD'!$A25,'07 PDR'!$K$4:$K$5600,'05 CPD'!R$2))","v":""},null,{"$f":"IF(SUMIFS('07 PDR'!$F$4:$F$5600,'07 PDR'!$A$4:$A$5600,'05 CPD'!$A25,'07 PDR'!$L$4:$L$5600,'05 CPD'!T$2)=0,\"\",SUMIFS('07 PDR'!$F$4:$F$5600,'07 PDR'!$A$4:$A$5600,'05 CPD'!$A25,'07 PDR'!$L$4:$L$5600,'05 CPD'!T$2))","v":""},{"$f":"IF(SUMIFS('07 PDR'!$F$4:$F$5600,'07 PDR'!$A$4:$A$5600,'05 CPD'!$A25,'07 PDR'!$L$4:$L$5600,'05 CPD'!U$2)=0,\"\",SUMIFS('07 PDR'!$F$4:$F$5600,'07 PDR'!$A$4:$A$5600,'05 CPD'!$A25,'07 PDR'!$L$4:$L$5600,'05 CPD'!U$2))","v":""},{"$f":"IF(SUMIFS('07 PDR'!$F$4:$F$5600,'07 PDR'!$A$4:$A$5600,'05 CPD'!$A25,'07 PDR'!$L$4:$L$5600,'05 CPD'!V$2)=0,\"\",SUMIFS('07 PDR'!$F$4:$F$5600,'07 PDR'!$A$4:$A$5600,'05 CPD'!$A25,'07 PDR'!$L$4:$L$5600,'05 CPD'!V$2))","v":""},{"$f":"IF(SUMIFS('07 PDR'!$F$4:$F$5600,'07 PDR'!$A$4:$A$5600,'05 CPD'!$A25,'07 PDR'!$L$4:$L$5600,'05 CPD'!W$2)=0,\"\",SUMIFS('07 PDR'!$F$4:$F$5600,'07 PDR'!$A$4:$A$5600,'05 CPD'!$A25,'07 PDR'!$L$4:$L$5600,'05 CPD'!W$2))","v":""},{"$f":"IF(SUMIFS('07 PDR'!$F$4:$F$5600,'07 PDR'!$A$4:$A$5600,'05 CPD'!$A25,'07 PDR'!$L$4:$L$5600,'05 CPD'!X$2)=0,\"\",SUMIFS('07 PDR'!$F$4:$F$5600,'07 PDR'!$A$4:$A$5600,'05 CPD'!$A25,'07 PDR'!$L$4:$L$5600,'05 CPD'!X$2))","v":""},{"$f":"IF(SUMIFS('07 PDR'!$F$4:$F$5600,'07 PDR'!$A$4:$A$5600,'05 CPD'!$A25,'07 PDR'!$L$4:$L$5600,'05 CPD'!Y$2)=0,\"\",SUMIFS('07 PDR'!$F$4:$F$5600,'07 PDR'!$A$4:$A$5600,'05 CPD'!$A25,'07 PDR'!$L$4:$L$5600,'05 CPD'!Y$2))","v":""},{"$f":"IF(SUMIFS('07 PDR'!$F$4:$F$5600,'07 PDR'!$A$4:$A$5600,'05 CPD'!$A25,'07 PDR'!$L$4:$L$5600,'05 CPD'!Z$2)=0,\"\",SUMIFS('07 PDR'!$F$4:$F$5600,'07 PDR'!$A$4:$A$5600,'05 CPD'!$A25,'07 PDR'!$L$4:$L$5600,'05 CPD'!Z$2))","v":""},{"$f":"IF(SUMIFS('07 PDR'!$F$4:$F$5600,'07 PDR'!$A$4:$A$5600,'05 CPD'!$A25,'07 PDR'!$L$4:$L$5600,'05 CPD'!AA$2)=0,\"\",SUMIFS('07 PDR'!$F$4:$F$5600,'07 PDR'!$A$4:$A$5600,'05 CPD'!$A25,'07 PDR'!$L$4:$L$5600,'05 CPD'!AA$2))","v":""},{"$f":"IF(SUMIFS('07 PDR'!$F$4:$F$5600,'07 PDR'!$A$4:$A$5600,'05 CPD'!$A25,'07 PDR'!$L$4:$L$5600,'05 CPD'!AB$2)=0,\"\",SUMIFS('07 PDR'!$F$4:$F$5600,'07 PDR'!$A$4:$A$5600,'05 CPD'!$A25,'07 PDR'!$L$4:$L$5600,'05 CPD'!AB$2))","v":""},{"$f":"IF(SUMIFS('07 PDR'!$F$4:$F$5600,'07 PDR'!$A$4:$A$5600,'05 CPD'!$A25,'07 PDR'!$L$4:$L$5600,'05 CPD'!AC$2)=0,\"\",SUMIFS('07 PDR'!$F$4:$F$5600,'07 PDR'!$A$4:$A$5600,'05 CPD'!$A25,'07 PDR'!$L$4:$L$5600,'05 CPD'!AC$2))","v":""},{"$f":"IF(SUMIFS('07 PDR'!$F$4:$F$5600,'07 PDR'!$A$4:$A$5600,'05 CPD'!$A25,'07 PDR'!$L$4:$L$5600,'05 CPD'!AD$2)=0,\"\",SUMIFS('07 PDR'!$F$4:$F$5600,'07 PDR'!$A$4:$A$5600,'05 CPD'!$A25,'07 PDR'!$L$4:$L$5600,'05 CPD'!AD$2))","v":""},{"$f":"IF(SUMIFS('07 PDR'!$F$4:$F$5600,'07 PDR'!$A$4:$A$5600,'05 CPD'!$A25,'07 PDR'!$L$4:$L$5600,'05 CPD'!AE$2)=0,\"\",SUMIFS('07 PDR'!$F$4:$F$5600,'07 PDR'!$A$4:$A$5600,'05 CPD'!$A25,'07 PDR'!$L$4:$L$5600,'05 CPD'!AE$2))","v":""},{"$f":"IF(SUMIFS('07 PDR'!$F$4:$F$5600,'07 PDR'!$A$4:$A$5600,'05 CPD'!$A25,'07 PDR'!$L$4:$L$5600,'05 CPD'!AF$2)=0,\"\",SUMIFS('07 PDR'!$F$4:$F$5600,'07 PDR'!$A$4:$A$5600,'05 CPD'!$A25,'07 PDR'!$L$4:$L$5600,'05 CPD'!AF$2))","v":""}]
["<Insert Period Range for Period 24>","","","",null,null,null,{"$f":"IF(SUMIFS('07 PDR'!$F$4:$F$5600,'07 PDR'!$A$4:$A$5600,'05 CPD'!$A26,'07 PDR'!$K$4:$K$5600,'05 CPD'!H$2)=0,\"\",SUMIFS('07 PDR'!$F$4:$F$5600,'07 PDR'!$A$4:$A$5600,'05 CPD'!$A26,'07 PDR'!$K$4:$K$5600,'05 CPD'!H$2))","v":""},{"$f":"IF(SUMIFS('07 PDR'!$F$4:$F$5600,'07 PDR'!$A$4:$A$5600,'05 CPD'!$A26,'07 PDR'!$K$4:$K$5600,'05 CPD'!I$2)=0,\"\",SUMIFS('07 PDR'!$F$4:$F$5600,'07 PDR'!$A$4:$A$5600,'05 CPD'!$A26,'07 PDR'!$K$4:$K$5600,'05 CPD'!I$2))","v":""},{"$f":"IF(SUMIFS('07 PDR'!$F$4:$F$5600,'07 PDR'!$A$4:$A$5600,'05 CPD'!$A26,'07 PDR'!$K$4:$K$5600,'05 CPD'!J$2)=0,\"\",SUMIFS('07 PDR'!$F$4:$F$5600,'07 PDR'!$A$4:$A$5600,'05 CPD'!$A26,'07 PDR'!$K$4:$K$5600,'05 CPD'!J$2))","v":""},{"$f":"IF(SUMIFS('07 PDR'!$F$4:$F$5600,'07 PDR'!$A$4:$A$5600,'05 CPD'!$A26,'07 PDR'!$K$4:$K$5600,'05 CPD'!K$2)=0,\"\",SUMIFS('07 PDR'!$F$4:$F$5600,'07 PDR'!$A$4:$A$5600,'05 CPD'!$A26,'07 PDR'!$K$4:$K$5600,'05 CPD'!K$2))","v":""},{"$f":"IF(SUMIFS('07 PDR'!$F$4:$F$5600,'07 PDR'!$A$4:$A$5600,'05 CPD'!$A26,'07 PDR'!$K$4:$K$5600,'05 CPD'!L$2)=0,\"\",SUMIFS('07 PDR'!$F$4:$F$5600,'07 PDR'!$A$4:$A$5600,'05 CPD'!$A26,'07 PDR'!$K$4:$K$5600,'05 CPD'!L$2))","v":""},{"$f":"IF(SUMIFS('07 PDR'!$F$4:$F$5600,'07 PDR'!$A$4:$A$5600,'05 CPD'!$A26,'07 PDR'!$K$4:$K$5600,'05 CPD'!M$2)=0,\"\",SUMIFS('07 PDR'!$F$4:$F$5600,'07 PDR'!$A$4:$A$5600,'05 CPD'!$A26,'07 PDR'!$K$4:$K$5600,'05 CPD'!M$2))","v":""},{"$f":"IF(SUMIFS('07 PDR'!$F$4:$F$5600,'07 PDR'!$A$4:$A$5600,'05 CPD'!$A26,'07 PDR'!$K$4:$K$5600,'05 CPD'!N$2)=0,\"\",SUMIFS('07 PDR'!$F$4:$F$5600,'07 PDR'!$A$4:$A$5600,'05 CPD'!$A26,'07 PDR'!$K$4:$K$5600,'05 CPD'!N$2))","v":""},{"$f":"IF(SUMIFS('07 PDR'!$F$4:$F$5600,'07 PDR'!$A$4:$A$5600,'05 CPD'!$A26,'07 PDR'!$K$4:$K$5600,'05 CPD'!O$2)=0,\"\",SUMIFS('07 PDR'!$F$4:$F$5600,'07 PDR'!$A$4:$A$5600,'05 CPD'!$A26,'07 PDR'!$K$4:$K$5600,'05 CPD'!O$2))","v":""},{"$f":"IF(SUMIFS('07 PDR'!$F$4:$F$5600,'07 PDR'!$A$4:$A$5600,'05 CPD'!$A26,'07 PDR'!$K$4:$K$5600,'05 CPD'!P$2)=0,\"\",SUMIFS('07 PDR'!$F$4:$F$5600,'07 PDR'!$A$4:$A$5600,'05 CPD'!$A26,'07 PDR'!$K$4:$K$5600,'05 CPD'!P$2))","v":""},{"$f":"IF(SUMIFS('07 PDR'!$F$4:$F$5600,'07 PDR'!$A$4:$A$5600,'05 CPD'!$A26,'07 PDR'!$K$4:$K$5600,'05 CPD'!Q$2)=0,\"\",SUMIFS('07 PDR'!$F$4:$F$5600,'07 PDR'!$A$4:$A$5600,'05 CPD'!$A26,'07 PDR'!$K$4:$K$5600,'05 CPD'!Q$2))","v":""},{"$f":"IF(SUMIFS('07 PDR'!$F$4:$F$5600,'07 PDR'!$A$4:$A$5600,'05 CPD'!$A26,'07 PDR'!$K$4:$K$5600,'05 CPD'!R$2)=0,\"\",SUMIFS('07 PDR'!$F$4:$F$5600,'07 PDR'!$A$4:$A$5600,'05 CPD'!$A26,'07 PDR'!$K$4:$K$5600,'05 CPD'!R$2))","v":""},null,{"$f":"IF(SUMIFS('07 PDR'!$F$4:$F$5600,'07 PDR'!$A$4:$A$5600,'05 CPD'!$A26,'07 PDR'!$L$4:$L$5600,'05 CPD'!T$2)=0,\"\",SUMIFS('07 PDR'!$F$4:$F$5600,'07 PDR'!$A$4:$A$5600,'05 CPD'!$A26,'07 PDR'!$L$4:$L$5600,'05 CPD'!T$2))","v":""},{"$f":"IF(SUMIFS('07 PDR'!$F$4:$F$5600,'07 PDR'!$A$4:$A$5600,'05 CPD'!$A26,'07 PDR'!$L$4:$L$5600,'05 CPD'!U$2)=0,\"\",SUMIFS('07 PDR'!$F$4:$F$5600,'07 PDR'!$A$4:$A$5600,'05 CPD'!$A26,'07 PDR'!$L$4:$L$5600,'05 CPD'!U$2))","v":""},{"$f":"IF(SUMIFS('07 PDR'!$F$4:$F$5600,'07 PDR'!$A$4:$A$5600,'05 CPD'!$A26,'07 PDR'!$L$4:$L$5600,'05 CPD'!V$2)=0,\"\",SUMIFS('07 PDR'!$F$4:$F$5600,'07 PDR'!$A$4:$A$5600,'05 CPD'!$A26,'07 PDR'!$L$4:$L$5600,'05 CPD'!V$2))","v":""},{"$f":"IF(SUMIFS('07 PDR'!$F$4:$F$5600,'07 PDR'!$A$4:$A$5600,'05 CPD'!$A26,'07 PDR'!$L$4:$L$5600,'05 CPD'!W$2)=0,\"\",SUMIFS('07 PDR'!$F$4:$F$5600,'07 PDR'!$A$4:$A$5600,'05 CPD'!$A26,'07 PDR'!$L$4:$L$5600,'05 CPD'!W$2))","v":""},{"$f":"IF(SUMIFS('07 PDR'!$F$4:$F$5600,'07 PDR'!$A$4:$A$5600,'05 CPD'!$A26,'07 PDR'!$L$4:$L$5600,'05 CPD'!X$2)=0,\"\",SUMIFS('07 PDR'!$F$4:$F$5600,'07 PDR'!$A$4:$A$5600,'05 CPD'!$A26,'07 PDR'!$L$4:$L$5600,'05 CPD'!X$2))","v":""},{"$f":"IF(SUMIFS('07 PDR'!$F$4:$F$5600,'07 PDR'!$A$4:$A$5600,'05 CPD'!$A26,'07 PDR'!$L$4:$L$5600,'05 CPD'!Y$2)=0,\"\",SUMIFS('07 PDR'!$F$4:$F$5600,'07 PDR'!$A$4:$A$5600,'05 CPD'!$A26,'07 PDR'!$L$4:$L$5600,'05 CPD'!Y$2))","v":""},{"$f":"IF(SUMIFS('07 PDR'!$F$4:$F$5600,'07 PDR'!$A$4:$A$5600,'05 CPD'!$A26,'07 PDR'!$L$4:$L$5600,'05 CPD'!Z$2)=0,\"\",SUMIFS('07 PDR'!$F$4:$F$5600,'07 PDR'!$A$4:$A$5600,'05 CPD'!$A26,'07 PDR'!$L$4:$L$5600,'05 CPD'!Z$2))","v":""},{"$f":"IF(SUMIFS('07 PDR'!$F$4:$F$5600,'07 PDR'!$A$4:$A$5600,'05 CPD'!$A26,'07 PDR'!$L$4:$L$5600,'05 CPD'!AA$2)=0,\"\",SUMIFS('07 PDR'!$F$4:$F$5600,'07 PDR'!$A$4:$A$5600,'05 CPD'!$A26,'07 PDR'!$L$4:$L$5600,'05 CPD'!AA$2))","v":""},{"$f":"IF(SUMIFS('07 PDR'!$F$4:$F$5600,'07 PDR'!$A$4:$A$5600,'05 CPD'!$A26,'07 PDR'!$L$4:$L$5600,'05 CPD'!AB$2)=0,\"\",SUMIFS('07 PDR'!$F$4:$F$5600,'07 PDR'!$A$4:$A$5600,'05 CPD'!$A26,'07 PDR'!$L$4:$L$5600,'05 CPD'!AB$2))","v":""},{"$f":"IF(SUMIFS('07 PDR'!$F$4:$F$5600,'07 PDR'!$A$4:$A$5600,'05 CPD'!$A26,'07 PDR'!$L$4:$L$5600,'05 CPD'!AC$2)=0,\"\",SUMIFS('07 PDR'!$F$4:$F$5600,'07 PDR'!$A$4:$A$5600,'05 CPD'!$A26,'07 PDR'!$L$4:$L$5600,'05 CPD'!AC$2))","v":""},{"$f":"IF(SUMIFS('07 PDR'!$F$4:$F$5600,'07 PDR'!$A$4:$A$5600,'05 CPD'!$A26,'07 PDR'!$L$4:$L$5600,'05 CPD'!AD$2)=0,\"\",SUMIFS('07 PDR'!$F$4:$F$5600,'07 PDR'!$A$4:$A$5600,'05 CPD'!$A26,'07 PDR'!$L$4:$L$5600,'05 CPD'!AD$2))","v":""},{"$f":"IF(SUMIFS('07 PDR'!$F$4:$F$5600,'07 PDR'!$A$4:$A$5600,'05 CPD'!$A26,'07 PDR'!$L$4:$L$5600,'05 CPD'!AE$2)=0,\"\",SUMIFS('07 PDR'!$F$4:$F$5600,'07 PDR'!$A$4:$A$5600,'05 CPD'!$A26,'07 PDR'!$L$4:$L$5600,'05 CPD'!AE$2))","v":""},{"$f":"IF(SUMIFS('07 PDR'!$F$4:$F$5600,'07 PDR'!$A$4:$A$5600,'05 CPD'!$A26,'07 PDR'!$L$4:$L$5600,'05 CPD'!AF$2)=0,\"\",SUMIFS('07 PDR'!$F$4:$F$5600,'07 PDR'!$A$4:$A$5600,'05 CPD'!$A26,'07 PDR'!$L$4:$L$5600,'05 CPD'!AF$2))","v":""}]
["<Insert Period Range for Period 25>","","","",null,null,null,{"$f":"IF(SUMIFS('07 PDR'!$F$4:$F$5600,'07 PDR'!$A$4:$A$5600,'05 CPD'!$A27,'07 PDR'!$K$4:$K$5600,'05 CPD'!H$2)=0,\"\",SUMIFS('07 PDR'!$F$4:$F$5600,'07 PDR'!$A$4:$A$5600,'05 CPD'!$A27,'07 PDR'!$K$4:$K$5600,'05 CPD'!H$2))","v":""},{"$f":"IF(SUMIFS('07 PDR'!$F$4:$F$5600,'07 PDR'!$A$4:$A$5600,'05 CPD'!$A27,'07 PDR'!$K$4:$K$5600,'05 CPD'!I$2)=0,\"\",SUMIFS('07 PDR'!$F$4:$F$5600,'07 PDR'!$A$4:$A$5600,'05 CPD'!$A27,'07 PDR'!$K$4:$K$5600,'05 CPD'!I$2))","v":""},{"$f":"IF(SUMIFS('07 PDR'!$F$4:$F$5600,'07 PDR'!$A$4:$A$5600,'05 CPD'!$A27,'07 PDR'!$K$4:$K$5600,'05 CPD'!J$2)=0,\"\",SUMIFS('07 PDR'!$F$4:$F$5600,'07 PDR'!$A$4:$A$5600,'05 CPD'!$A27,'07 PDR'!$K$4:$K$5600,'05 CPD'!J$2))","v":""},{"$f":"IF(SUMIFS('07 PDR'!$F$4:$F$5600,'07 PDR'!$A$4:$A$5600,'05 CPD'!$A27,'07 PDR'!$K$4:$K$5600,'05 CPD'!K$2)=0,\"\",SUMIFS('07 PDR'!$F$4:$F$5600,'07 PDR'!$A$4:$A$5600,'05 CPD'!$A27,'07 PDR'!$K$4:$K$5600,'05 CPD'!K$2))","v":""},{"$f":"IF(SUMIFS('07 PDR'!$F$4:$F$5600,'07 PDR'!$A$4:$A$5600,'05 CPD'!$A27,'07 PDR'!$K$4:$K$5600,'05 CPD'!L$2)=0,\"\",SUMIFS('07 PDR'!$F$4:$F$5600,'07 PDR'!$A$4:$A$5600,'05 CPD'!$A27,'07 PDR'!$K$4:$K$5600,'05 CPD'!L$2))","v":""},{"$f":"IF(SUMIFS('07 PDR'!$F$4:$F$5600,'07 PDR'!$A$4:$A$5600,'05 CPD'!$A27,'07 PDR'!$K$4:$K$5600,'05 CPD'!M$2)=0,\"\",SUMIFS('07 PDR'!$F$4:$F$5600,'07 PDR'!$A$4:$A$5600,'05 CPD'!$A27,'07 PDR'!$K$4:$K$5600,'05 CPD'!M$2))","v":""},{"$f":"IF(SUMIFS('07 PDR'!$F$4:$F$5600,'07 PDR'!$A$4:$A$5600,'05 CPD'!$A27,'07 PDR'!$K$4:$K$5600,'05 CPD'!N$2)=0,\"\",SUMIFS('07 PDR'!$F$4:$F$5600,'07 PDR'!$A$4:$A$5600,'05 CPD'!$A27,'07 PDR'!$K$4:$K$5600,'05 CPD'!N$2))","v":""},{"$f":"IF(SUMIFS('07 PDR'!$F$4:$F$5600,'07 PDR'!$A$4:$A$5600,'05 CPD'!$A27,'07 PDR'!$K$4:$K$5600,'05 CPD'!O$2)=0,\"\",SUMIFS('07 PDR'!$F$4:$F$5600,'07 PDR'!$A$4:$A$5600,'05 CPD'!$A27,'07 PDR'!$K$4:$K$5600,'05 CPD'!O$2))","v":""},{"$f":"IF(SUMIFS('07 PDR'!$F$4:$F$5600,'07 PDR'!$A$4:$A$5600,'05 CPD'!$A27,'07 PDR'!$K$4:$K$5600,'05 CPD'!P$2)=0,\"\",SUMIFS('07 PDR'!$F$4:$F$5600,'07 PDR'!$A$4:$A$5600,'05 CPD'!$A27,'07 PDR'!$K$4:$K$5600,'05 CPD'!P$2))","v":""},{"$f":"IF(SUMIFS('07 PDR'!$F$4:$F$5600,'07 PDR'!$A$4:$A$5600,'05 CPD'!$A27,'07 PDR'!$K$4:$K$5600,'05 CPD'!Q$2)=0,\"\",SUMIFS('07 PDR'!$F$4:$F$5600,'07 PDR'!$A$4:$A$5600,'05 CPD'!$A27,'07 PDR'!$K$4:$K$5600,'05 CPD'!Q$2))","v":""},{"$f":"IF(SUMIFS('07 PDR'!$F$4:$F$5600,'07 PDR'!$A$4:$A$5600,'05 CPD'!$A27,'07 PDR'!$K$4:$K$5600,'05 CPD'!R$2)=0,\"\",SUMIFS('07 PDR'!$F$4:$F$5600,'07 PDR'!$A$4:$A$5600,'05 CPD'!$A27,'07 PDR'!$K$4:$K$5600,'05 CPD'!R$2))","v":""},null,{"$f":"IF(SUMIFS('07 PDR'!$F$4:$F$5600,'07 PDR'!$A$4:$A$5600,'05 CPD'!$A27,'07 PDR'!$L$4:$L$5600,'05 CPD'!T$2)=0,\"\",SUMIFS('07 PDR'!$F$4:$F$5600,'07 PDR'!$A$4:$A$5600,'05 CPD'!$A27,'07 PDR'!$L$4:$L$5600,'05 CPD'!T$2))","v":""},{"$f":"IF(SUMIFS('07 PDR'!$F$4:$F$5600,'07 PDR'!$A$4:$A$5600,'05 CPD'!$A27,'07 PDR'!$L$4:$L$5600,'05 CPD'!U$2)=0,\"\",SUMIFS('07 PDR'!$F$4:$F$5600,'07 PDR'!$A$4:$A$5600,'05 CPD'!$A27,'07 PDR'!$L$4:$L$5600,'05 CPD'!U$2))","v":""},{"$f":"IF(SUMIFS('07 PDR'!$F$4:$F$5600,'07 PDR'!$A$4:$A$5600,'05 CPD'!$A27,'07 PDR'!$L$4:$L$5600,'05 CPD'!V$2)=0,\"\",SUMIFS('07 PDR'!$F$4:$F$5600,'07 PDR'!$A$4:$A$5600,'05 CPD'!$A27,'07 PDR'!$L$4:$L$5600,'05 CPD'!V$2))","v":""},{"$f":"IF(SUMIFS('07 PDR'!$F$4:$F$5600,'07 PDR'!$A$4:$A$5600,'05 CPD'!$A27,'07 PDR'!$L$4:$L$5600,'05 CPD'!W$2)=0,\"\",SUMIFS('07 PDR'!$F$4:$F$5600,'07 PDR'!$A$4:$A$5600,'05 CPD'!$A27,'07 PDR'!$L$4:$L$5600,'05 CPD'!W$2))","v":""},{"$f":"IF(SUMIFS('07 PDR'!$F$4:$F$5600,'07 PDR'!$A$4:$A$5600,'05 CPD'!$A27,'07 PDR'!$L$4:$L$5600,'05 CPD'!X$2)=0,\"\",SUMIFS('07 PDR'!$F$4:$F$5600,'07 PDR'!$A$4:$A$5600,'05 CPD'!$A27,'07 PDR'!$L$4:$L$5600,'05 CPD'!X$2))","v":""},{"$f":"IF(SUMIFS('07 PDR'!$F$4:$F$5600,'07 PDR'!$A$4:$A$5600,'05 CPD'!$A27,'07 PDR'!$L$4:$L$5600,'05 CPD'!Y$2)=0,\"\",SUMIFS('07 PDR'!$F$4:$F$5600,'07 PDR'!$A$4:$A$5600,'05 CPD'!$A27,'07 PDR'!$L$4:$L$5600,'05 CPD'!Y$2))","v":""},{"$f":"IF(SUMIFS('07 PDR'!$F$4:$F$5600,'07 PDR'!$A$4:$A$5600,'05 CPD'!$A27,'07 PDR'!$L$4:$L$5600,'05 CPD'!Z$2)=0,\"\",SUMIFS('07 PDR'!$F$4:$F$5600,'07 PDR'!$A$4:$A$5600,'05 CPD'!$A27,'07 PDR'!$L$4:$L$5600,'05 CPD'!Z$2))","v":""},{"$f":"IF(SUMIFS('07 PDR'!$F$4:$F$5600,'07 PDR'!$A$4:$A$5600,'05 CPD'!$A27,'07 PDR'!$L$4:$L$5600,'05 CPD'!AA$2)=0,\"\",SUMIFS('07 PDR'!$F$4:$F$5600,'07 PDR'!$A$4:$A$5600,'05 CPD'!$A27,'07 PDR'!$L$4:$L$5600,'05 CPD'!AA$2))","v":""},{"$f":"IF(SUMIFS('07 PDR'!$F$4:$F$5600,'07 PDR'!$A$4:$A$5600,'05 CPD'!$A27,'07 PDR'!$L$4:$L$5600,'05 CPD'!AB$2)=0,\"\",SUMIFS('07 PDR'!$F$4:$F$5600,'07 PDR'!$A$4:$A$5600,'05 CPD'!$A27,'07 PDR'!$L$4:$L$5600,'05 CPD'!AB$2))","v":""},{"$f":"IF(SUMIFS('07 PDR'!$F$4:$F$5600,'07 PDR'!$A$4:$A$5600,'05 CPD'!$A27,'07 PDR'!$L$4:$L$5600,'05 CPD'!AC$2)=0,\"\",SUMIFS('07 PDR'!$F$4:$F$5600,'07 PDR'!$A$4:$A$5600,'05 CPD'!$A27,'07 PDR'!$L$4:$L$5600,'05 CPD'!AC$2))","v":""},{"$f":"IF(SUMIFS('07 PDR'!$F$4:$F$5600,'07 PDR'!$A$4:$A$5600,'05 CPD'!$A27,'07 PDR'!$L$4:$L$5600,'05 CPD'!AD$2)=0,\"\",SUMIFS('07 PDR'!$F$4:$F$5600,'07 PDR'!$A$4:$A$5600,'05 CPD'!$A27,'07 PDR'!$L$4:$L$5600,'05 CPD'!AD$2))","v":""},{"$f":"IF(SUMIFS('07 PDR'!$F$4:$F$5600,'07 PDR'!$A$4:$A$5600,'05 CPD'!$A27,'07 PDR'!$L$4:$L$5600,'05 CPD'!AE$2)=0,\"\",SUMIFS('07 PDR'!$F$4:$F$5600,'07 PDR'!$A$4:$A$5600,'05 CPD'!$A27,'07 PDR'!$L$4:$L$5600,'05 CPD'!AE$2))","v":""},{"$f":"IF(SUMIFS('07 PDR'!$F$4:$F$5600,'07 PDR'!$A$4:$A$5600,'05 CPD'!$A27,'07 PDR'!$L$4:$L$5600,'05 CPD'!AF$2)=0,\"\",SUMIFS('07 PDR'!$F$4:$F$5600,'07 PDR'!$A$4:$A$5600,'05 CPD'!$A27,'07 PDR'!$L$4:$L$5600,'05 CPD'!AF$2))","v":""}]
["<Insert Period Range for Period 26>","","","",null,null,null,{"$f":"IF(SUMIFS('07 PDR'!$F$4:$F$5600,'07 PDR'!$A$4:$A$5600,'05 CPD'!$A28,'07 PDR'!$K$4:$K$5600,'05 CPD'!H$2)=0,\"\",SUMIFS('07 PDR'!$F$4:$F$5600,'07 PDR'!$A$4:$A$5600,'05 CPD'!$A28,'07 PDR'!$K$4:$K$5600,'05 CPD'!H$2))","v":""},{"$f":"IF(SUMIFS('07 PDR'!$F$4:$F$5600,'07 PDR'!$A$4:$A$5600,'05 CPD'!$A28,'07 PDR'!$K$4:$K$5600,'05 CPD'!I$2)=0,\"\",SUMIFS('07 PDR'!$F$4:$F$5600,'07 PDR'!$A$4:$A$5600,'05 CPD'!$A28,'07 PDR'!$K$4:$K$5600,'05 CPD'!I$2))","v":""},{"$f":"IF(SUMIFS('07 PDR'!$F$4:$F$5600,'07 PDR'!$A$4:$A$5600,'05 CPD'!$A28,'07 PDR'!$K$4:$K$5600,'05 CPD'!J$2)=0,\"\",SUMIFS('07 PDR'!$F$4:$F$5600,'07 PDR'!$A$4:$A$5600,'05 CPD'!$A28,'07 PDR'!$K$4:$K$5600,'05 CPD'!J$2))","v":""},{"$f":"IF(SUMIFS('07 PDR'!$F$4:$F$5600,'07 PDR'!$A$4:$A$5600,'05 CPD'!$A28,'07 PDR'!$K$4:$K$5600,'05 CPD'!K$2)=0,\"\",SUMIFS('07 PDR'!$F$4:$F$5600,'07 PDR'!$A$4:$A$5600,'05 CPD'!$A28,'07 PDR'!$K$4:$K$5600,'05 CPD'!K$2))","v":""},{"$f":"IF(SUMIFS('07 PDR'!$F$4:$F$5600,'07 PDR'!$A$4:$A$5600,'05 CPD'!$A28,'07 PDR'!$K$4:$K$5600,'05 CPD'!L$2)=0,\"\",SUMIFS('07 PDR'!$F$4:$F$5600,'07 PDR'!$A$4:$A$5600,'05 CPD'!$A28,'07 PDR'!$K$4:$K$5600,'05 CPD'!L$2))","v":""},{"$f":"IF(SUMIFS('07 PDR'!$F$4:$F$5600,'07 PDR'!$A$4:$A$5600,'05 CPD'!$A28,'07 PDR'!$K$4:$K$5600,'05 CPD'!M$2)=0,\"\",SUMIFS('07 PDR'!$F$4:$F$5600,'07 PDR'!$A$4:$A$5600,'05 CPD'!$A28,'07 PDR'!$K$4:$K$5600,'05 CPD'!M$2))","v":""},{"$f":"IF(SUMIFS('07 PDR'!$F$4:$F$5600,'07 PDR'!$A$4:$A$5600,'05 CPD'!$A28,'07 PDR'!$K$4:$K$5600,'05 CPD'!N$2)=0,\"\",SUMIFS('07 PDR'!$F$4:$F$5600,'07 PDR'!$A$4:$A$5600,'05 CPD'!$A28,'07 PDR'!$K$4:$K$5600,'05 CPD'!N$2))","v":""},{"$f":"IF(SUMIFS('07 PDR'!$F$4:$F$5600,'07 PDR'!$A$4:$A$5600,'05 CPD'!$A28,'07 PDR'!$K$4:$K$5600,'05 CPD'!O$2)=0,\"\",SUMIFS('07 PDR'!$F$4:$F$5600,'07 PDR'!$A$4:$A$5600,'05 CPD'!$A28,'07 PDR'!$K$4:$K$5600,'05 CPD'!O$2))","v":""},{"$f":"IF(SUMIFS('07 PDR'!$F$4:$F$5600,'07 PDR'!$A$4:$A$5600,'05 CPD'!$A28,'07 PDR'!$K$4:$K$5600,'05 CPD'!P$2)=0,\"\",SUMIFS('07 PDR'!$F$4:$F$5600,'07 PDR'!$A$4:$A$5600,'05 CPD'!$A28,'07 PDR'!$K$4:$K$5600,'05 CPD'!P$2))","v":""},{"$f":"IF(SUMIFS('07 PDR'!$F$4:$F$5600,'07 PDR'!$A$4:$A$5600,'05 CPD'!$A28,'07 PDR'!$K$4:$K$5600,'05 CPD'!Q$2)=0,\"\",SUMIFS('07 PDR'!$F$4:$F$5600,'07 PDR'!$A$4:$A$5600,'05 CPD'!$A28,'07 PDR'!$K$4:$K$5600,'05 CPD'!Q$2))","v":""},{"$f":"IF(SUMIFS('07 PDR'!$F$4:$F$5600,'07 PDR'!$A$4:$A$5600,'05 CPD'!$A28,'07 PDR'!$K$4:$K$5600,'05 CPD'!R$2)=0,\"\",SUMIFS('07 PDR'!$F$4:$F$5600,'07 PDR'!$A$4:$A$5600,'05 CPD'!$A28,'07 PDR'!$K$4:$K$5600,'05 CPD'!R$2))","v":""},null,{"$f":"IF(SUMIFS('07 PDR'!$F$4:$F$5600,'07 PDR'!$A$4:$A$5600,'05 CPD'!$A28,'07 PDR'!$L$4:$L$5600,'05 CPD'!T$2)=0,\"\",SUMIFS('07 PDR'!$F$4:$F$5600,'07 PDR'!$A$4:$A$5600,'05 CPD'!$A28,'07 PDR'!$L$4:$L$5600,'05 CPD'!T$2))","v":""},{"$f":"IF(SUMIFS('07 PDR'!$F$4:$F$5600,'07 PDR'!$A$4:$A$5600,'05 CPD'!$A28,'07 PDR'!$L$4:$L$5600,'05 CPD'!U$2)=0,\"\",SUMIFS('07 PDR'!$F$4:$F$5600,'07 PDR'!$A$4:$A$5600,'05 CPD'!$A28,'07 PDR'!$L$4:$L$5600,'05 CPD'!U$2))","v":""},{"$f":"IF(SUMIFS('07 PDR'!$F$4:$F$5600,'07 PDR'!$A$4:$A$5600,'05 CPD'!$A28,'07 PDR'!$L$4:$L$5600,'05 CPD'!V$2)=0,\"\",SUMIFS('07 PDR'!$F$4:$F$5600,'07 PDR'!$A$4:$A$5600,'05 CPD'!$A28,'07 PDR'!$L$4:$L$5600,'05 CPD'!V$2))","v":""},{"$f":"IF(SUMIFS('07 PDR'!$F$4:$F$5600,'07 PDR'!$A$4:$A$5600,'05 CPD'!$A28,'07 PDR'!$L$4:$L$5600,'05 CPD'!W$2)=0,\"\",SUMIFS('07 PDR'!$F$4:$F$5600,'07 PDR'!$A$4:$A$5600,'05 CPD'!$A28,'07 PDR'!$L$4:$L$5600,'05 CPD'!W$2))","v":""},{"$f":"IF(SUMIFS('07 PDR'!$F$4:$F$5600,'07 PDR'!$A$4:$A$5600,'05 CPD'!$A28,'07 PDR'!$L$4:$L$5600,'05 CPD'!X$2)=0,\"\",SUMIFS('07 PDR'!$F$4:$F$5600,'07 PDR'!$A$4:$A$5600,'05 CPD'!$A28,'07 PDR'!$L$4:$L$5600,'05 CPD'!X$2))","v":""},{"$f":"IF(SUMIFS('07 PDR'!$F$4:$F$5600,'07 PDR'!$A$4:$A$5600,'05 CPD'!$A28,'07 PDR'!$L$4:$L$5600,'05 CPD'!Y$2)=0,\"\",SUMIFS('07 PDR'!$F$4:$F$5600,'07 PDR'!$A$4:$A$5600,'05 CPD'!$A28,'07 PDR'!$L$4:$L$5600,'05 CPD'!Y$2))","v":""},{"$f":"IF(SUMIFS('07 PDR'!$F$4:$F$5600,'07 PDR'!$A$4:$A$5600,'05 CPD'!$A28,'07 PDR'!$L$4:$L$5600,'05 CPD'!Z$2)=0,\"\",SUMIFS('07 PDR'!$F$4:$F$5600,'07 PDR'!$A$4:$A$5600,'05 CPD'!$A28,'07 PDR'!$L$4:$L$5600,'05 CPD'!Z$2))","v":""},{"$f":"IF(SUMIFS('07 PDR'!$F$4:$F$5600,'07 PDR'!$A$4:$A$5600,'05 CPD'!$A28,'07 PDR'!$L$4:$L$5600,'05 CPD'!AA$2)=0,\"\",SUMIFS('07 PDR'!$F$4:$F$5600,'07 PDR'!$A$4:$A$5600,'05 CPD'!$A28,'07 PDR'!$L$4:$L$5600,'05 CPD'!AA$2))","v":""},{"$f":"IF(SUMIFS('07 PDR'!$F$4:$F$5600,'07 PDR'!$A$4:$A$5600,'05 CPD'!$A28,'07 PDR'!$L$4:$L$5600,'05 CPD'!AB$2)=0,\"\",SUMIFS('07 PDR'!$F$4:$F$5600,'07 PDR'!$A$4:$A$5600,'05 CPD'!$A28,'07 PDR'!$L$4:$L$5600,'05 CPD'!AB$2))","v":""},{"$f":"IF(SUMIFS('07 PDR'!$F$4:$F$5600,'07 PDR'!$A$4:$A$5600,'05 CPD'!$A28,'07 PDR'!$L$4:$L$5600,'05 CPD'!AC$2)=0,\"\",SUMIFS('07 PDR'!$F$4:$F$5600,'07 PDR'!$A$4:$A$5600,'05 CPD'!$A28,'07 PDR'!$L$4:$L$5600,'05 CPD'!AC$2))","v":""},{"$f":"IF(SUMIFS('07 PDR'!$F$4:$F$5600,'07 PDR'!$A$4:$A$5600,'05 CPD'!$A28,'07 PDR'!$L$4:$L$5600,'05 CPD'!AD$2)=0,\"\",SUMIFS('07 PDR'!$F$4:$F$5600,'07 PDR'!$A$4:$A$5600,'05 CPD'!$A28,'07 PDR'!$L$4:$L$5600,'05 CPD'!AD$2))","v":""},{"$f":"IF(SUMIFS('07 PDR'!$F$4:$F$5600,'07 PDR'!$A$4:$A$5600,'05 CPD'!$A28,'07 PDR'!$L$4:$L$5600,'05 CPD'!AE$2)=0,\"\",SUMIFS('07 PDR'!$F$4:$F$5600,'07 PDR'!$A$4:$A$5600,'05 CPD'!$A28,'07 PDR'!$L$4:$L$5600,'05 CPD'!AE$2))","v":""},{"$f":"IF(SUMIFS('07 PDR'!$F$4:$F$5600,'07 PDR'!$A$4:$A$5600,'05 CPD'!$A28,'07 PDR'!$L$4:$L$5600,'05 CPD'!AF$2)=0,\"\",SUMIFS('07 PDR'!$F$4:$F$5600,'07 PDR'!$A$4:$A$5600,'05 CPD'!$A28,'07 PDR'!$L$4:$L$5600,'05 CPD'!AF$2))","v":""}]
["<Insert Period Range for Period 27>","","","",null,null,null,{"$f":"IF(SUMIFS('07 PDR'!$F$4:$F$5600,'07 PDR'!$A$4:$A$5600,'05 CPD'!$A29,'07 PDR'!$K$4:$K$5600,'05 CPD'!H$2)=0,\"\",SUMIFS('07 PDR'!$F$4:$F$5600,'07 PDR'!$A$4:$A$5600,'05 CPD'!$A29,'07 PDR'!$K$4:$K$5600,'05 CPD'!H$2))","v":""},{"$f":"IF(SUMIFS('07 PDR'!$F$4:$F$5600,'07 PDR'!$A$4:$A$5600,'05 CPD'!$A29,'07 PDR'!$K$4:$K$5600,'05 CPD'!I$2)=0,\"\",SUMIFS('07 PDR'!$F$4:$F$5600,'07 PDR'!$A$4:$A$5600,'05 CPD'!$A29,'07 PDR'!$K$4:$K$5600,'05 CPD'!I$2))","v":""},{"$f":"IF(SUMIFS('07 PDR'!$F$4:$F$5600,'07 PDR'!$A$4:$A$5600,'05 CPD'!$A29,'07 PDR'!$K$4:$K$5600,'05 CPD'!J$2)=0,\"\",SUMIFS('07 PDR'!$F$4:$F$5600,'07 PDR'!$A$4:$A$5600,'05 CPD'!$A29,'07 PDR'!$K$4:$K$5600,'05 CPD'!J$2))","v":""},{"$f":"IF(SUMIFS('07 PDR'!$F$4:$F$5600,'07 PDR'!$A$4:$A$5600,'05 CPD'!$A29,'07 PDR'!$K$4:$K$5600,'05 CPD'!K$2)=0,\"\",SUMIFS('07 PDR'!$F$4:$F$5600,'07 PDR'!$A$4:$A$5600,'05 CPD'!$A29,'07 PDR'!$K$4:$K$5600,'05 CPD'!K$2))","v":""},{"$f":"IF(SUMIFS('07 PDR'!$F$4:$F$5600,'07 PDR'!$A$4:$A$5600,'05 CPD'!$A29,'07 PDR'!$K$4:$K$5600,'05 CPD'!L$2)=0,\"\",SUMIFS('07 PDR'!$F$4:$F$5600,'07 PDR'!$A$4:$A$5600,'05 CPD'!$A29,'07 PDR'!$K$4:$K$5600,'05 CPD'!L$2))","v":""},{"$f":"IF(SUMIFS('07 PDR'!$F$4:$F$5600,'07 PDR'!$A$4:$A$5600,'05 CPD'!$A29,'07 PDR'!$K$4:$K$5600,'05 CPD'!M$2)=0,\"\",SUMIFS('07 PDR'!$F$4:$F$5600,'07 PDR'!$A$4:$A$5600,'05 CPD'!$A29,'07 PDR'!$K$4:$K$5600,'05 CPD'!M$2))","v":""},{"$f":"IF(SUMIFS('07 PDR'!$F$4:$F$5600,'07 PDR'!$A$4:$A$5600,'05 CPD'!$A29,'07 PDR'!$K$4:$K$5600,'05 CPD'!N$2)=0,\"\",SUMIFS('07 PDR'!$F$4:$F$5600,'07 PDR'!$A$4:$A$5600,'05 CPD'!$A29,'07 PDR'!$K$4:$K$5600,'05 CPD'!N$2))","v":""},{"$f":"IF(SUMIFS('07 PDR'!$F$4:$F$5600,'07 PDR'!$A$4:$A$5600,'05 CPD'!$A29,'07 PDR'!$K$4:$K$5600,'05 CPD'!O$2)=0,\"\",SUMIFS('07 PDR'!$F$4:$F$5600,'07 PDR'!$A$4:$A$5600,'05 CPD'!$A29,'07 PDR'!$K$4:$K$5600,'05 CPD'!O$2))","v":""},{"$f":"IF(SUMIFS('07 PDR'!$F$4:$F$5600,'07 PDR'!$A$4:$A$5600,'05 CPD'!$A29,'07 PDR'!$K$4:$K$5600,'05 CPD'!P$2)=0,\"\",SUMIFS('07 PDR'!$F$4:$F$5600,'07 PDR'!$A$4:$A$5600,'05 CPD'!$A29,'07 PDR'!$K$4:$K$5600,'05 CPD'!P$2))","v":""},{"$f":"IF(SUMIFS('07 PDR'!$F$4:$F$5600,'07 PDR'!$A$4:$A$5600,'05 CPD'!$A29,'07 PDR'!$K$4:$K$5600,'05 CPD'!Q$2)=0,\"\",SUMIFS('07 PDR'!$F$4:$F$5600,'07 PDR'!$A$4:$A$5600,'05 CPD'!$A29,'07 PDR'!$K$4:$K$5600,'05 CPD'!Q$2))","v":""},{"$f":"IF(SUMIFS('07 PDR'!$F$4:$F$5600,'07 PDR'!$A$4:$A$5600,'05 CPD'!$A29,'07 PDR'!$K$4:$K$5600,'05 CPD'!R$2)=0,\"\",SUMIFS('07 PDR'!$F$4:$F$5600,'07 PDR'!$A$4:$A$5600,'05 CPD'!$A29,'07 PDR'!$K$4:$K$5600,'05 CPD'!R$2))","v":""},null,{"$f":"IF(SUMIFS('07 PDR'!$F$4:$F$5600,'07 PDR'!$A$4:$A$5600,'05 CPD'!$A29,'07 PDR'!$L$4:$L$5600,'05 CPD'!T$2)=0,\"\",SUMIFS('07 PDR'!$F$4:$F$5600,'07 PDR'!$A$4:$A$5600,'05 CPD'!$A29,'07 PDR'!$L$4:$L$5600,'05 CPD'!T$2))","v":""},{"$f":"IF(SUMIFS('07 PDR'!$F$4:$F$5600,'07 PDR'!$A$4:$A$5600,'05 CPD'!$A29,'07 PDR'!$L$4:$L$5600,'05 CPD'!U$2)=0,\"\",SUMIFS('07 PDR'!$F$4:$F$5600,'07 PDR'!$A$4:$A$5600,'05 CPD'!$A29,'07 PDR'!$L$4:$L$5600,'05 CPD'!U$2))","v":""},{"$f":"IF(SUMIFS('07 PDR'!$F$4:$F$5600,'07 PDR'!$A$4:$A$5600,'05 CPD'!$A29,'07 PDR'!$L$4:$L$5600,'05 CPD'!V$2)=0,\"\",SUMIFS('07 PDR'!$F$4:$F$5600,'07 PDR'!$A$4:$A$5600,'05 CPD'!$A29,'07 PDR'!$L$4:$L$5600,'05 CPD'!V$2))","v":""},{"$f":"IF(SUMIFS('07 PDR'!$F$4:$F$5600,'07 PDR'!$A$4:$A$5600,'05 CPD'!$A29,'07 PDR'!$L$4:$L$5600,'05 CPD'!W$2)=0,\"\",SUMIFS('07 PDR'!$F$4:$F$5600,'07 PDR'!$A$4:$A$5600,'05 CPD'!$A29,'07 PDR'!$L$4:$L$5600,'05 CPD'!W$2))","v":""},{"$f":"IF(SUMIFS('07 PDR'!$F$4:$F$5600,'07 PDR'!$A$4:$A$5600,'05 CPD'!$A29,'07 PDR'!$L$4:$L$5600,'05 CPD'!X$2)=0,\"\",SUMIFS('07 PDR'!$F$4:$F$5600,'07 PDR'!$A$4:$A$5600,'05 CPD'!$A29,'07 PDR'!$L$4:$L$5600,'05 CPD'!X$2))","v":""},{"$f":"IF(SUMIFS('07 PDR'!$F$4:$F$5600,'07 PDR'!$A$4:$A$5600,'05 CPD'!$A29,'07 PDR'!$L$4:$L$5600,'05 CPD'!Y$2)=0,\"\",SUMIFS('07 PDR'!$F$4:$F$5600,'07 PDR'!$A$4:$A$5600,'05 CPD'!$A29,'07 PDR'!$L$4:$L$5600,'05 CPD'!Y$2))","v":""},{"$f":"IF(SUMIFS('07 PDR'!$F$4:$F$5600,'07 PDR'!$A$4:$A$5600,'05 CPD'!$A29,'07 PDR'!$L$4:$L$5600,'05 CPD'!Z$2)=0,\"\",SUMIFS('07 PDR'!$F$4:$F$5600,'07 PDR'!$A$4:$A$5600,'05 CPD'!$A29,'07 PDR'!$L$4:$L$5600,'05 CPD'!Z$2))","v":""},{"$f":"IF(SUMIFS('07 PDR'!$F$4:$F$5600,'07 PDR'!$A$4:$A$5600,'05 CPD'!$A29,'07 PDR'!$L$4:$L$5600,'05 CPD'!AA$2)=0,\"\",SUMIFS('07 PDR'!$F$4:$F$5600,'07 PDR'!$A$4:$A$5600,'05 CPD'!$A29,'07 PDR'!$L$4:$L$5600,'05 CPD'!AA$2))","v":""},{"$f":"IF(SUMIFS('07 PDR'!$F$4:$F$5600,'07 PDR'!$A$4:$A$5600,'05 CPD'!$A29,'07 PDR'!$L$4:$L$5600,'05 CPD'!AB$2)=0,\"\",SUMIFS('07 PDR'!$F$4:$F$5600,'07 PDR'!$A$4:$A$5600,'05 CPD'!$A29,'07 PDR'!$L$4:$L$5600,'05 CPD'!AB$2))","v":""},{"$f":"IF(SUMIFS('07 PDR'!$F$4:$F$5600,'07 PDR'!$A$4:$A$5600,'05 CPD'!$A29,'07 PDR'!$L$4:$L$5600,'05 CPD'!AC$2)=0,\"\",SUMIFS('07 PDR'!$F$4:$F$5600,'07 PDR'!$A$4:$A$5600,'05 CPD'!$A29,'07 PDR'!$L$4:$L$5600,'05 CPD'!AC$2))","v":""},{"$f":"IF(SUMIFS('07 PDR'!$F$4:$F$5600,'07 PDR'!$A$4:$A$5600,'05 CPD'!$A29,'07 PDR'!$L$4:$L$5600,'05 CPD'!AD$2)=0,\"\",SUMIFS('07 PDR'!$F$4:$F$5600,'07 PDR'!$A$4:$A$5600,'05 CPD'!$A29,'07 PDR'!$L$4:$L$5600,'05 CPD'!AD$2))","v":""},{"$f":"IF(SUMIFS('07 PDR'!$F$4:$F$5600,'07 PDR'!$A$4:$A$5600,'05 CPD'!$A29,'07 PDR'!$L$4:$L$5600,'05 CPD'!AE$2)=0,\"\",SUMIFS('07 PDR'!$F$4:$F$5600,'07 PDR'!$A$4:$A$5600,'05 CPD'!$A29,'07 PDR'!$L$4:$L$5600,'05 CPD'!AE$2))","v":""},{"$f":"IF(SUMIFS('07 PDR'!$F$4:$F$5600,'07 PDR'!$A$4:$A$5600,'05 CPD'!$A29,'07 PDR'!$L$4:$L$5600,'05 CPD'!AF$2)=0,\"\",SUMIFS('07 PDR'!$F$4:$F$5600,'07 PDR'!$A$4:$A$5600,'05 CPD'!$A29,'07 PDR'!$L$4:$L$5600,'05 CPD'!AF$2))","v":""}]
["<Insert Period Range for Period 28>","","","",null,null,null,{"$f":"IF(SUMIFS('07 PDR'!$F$4:$F$5600,'07 PDR'!$A$4:$A$5600,'05 CPD'!$A30,'07 PDR'!$K$4:$K$5600,'05 CPD'!H$2)=0,\"\",SUMIFS('07 PDR'!$F$4:$F$5600,'07 PDR'!$A$4:$A$5600,'05 CPD'!$A30,'07 PDR'!$K$4:$K$5600,'05 CPD'!H$2))","v":""},{"$f":"IF(SUMIFS('07 PDR'!$F$4:$F$5600,'07 PDR'!$A$4:$A$5600,'05 CPD'!$A30,'07 PDR'!$K$4:$K$5600,'05 CPD'!I$2)=0,\"\",SUMIFS('07 PDR'!$F$4:$F$5600,'07 PDR'!$A$4:$A$5600,'05 CPD'!$A30,'07 PDR'!$K$4:$K$5600,'05 CPD'!I$2))","v":""},{"$f":"IF(SUMIFS('07 PDR'!$F$4:$F$5600,'07 PDR'!$A$4:$A$5600,'05 CPD'!$A30,'07 PDR'!$K$4:$K$5600,'05 CPD'!J$2)=0,\"\",SUMIFS('07 PDR'!$F$4:$F$5600,'07 PDR'!$A$4:$A$5600,'05 CPD'!$A30,'07 PDR'!$K$4:$K$5600,'05 CPD'!J$2))","v":""},{"$f":"IF(SUMIFS('07 PDR'!$F$4:$F$5600,'07 PDR'!$A$4:$A$5600,'05 CPD'!$A30,'07 PDR'!$K$4:$K$5600,'05 CPD'!K$2)=0,\"\",SUMIFS('07 PDR'!$F$4:$F$5600,'07 PDR'!$A$4:$A$5600,'05 CPD'!$A30,'07 PDR'!$K$4:$K$5600,'05 CPD'!K$2))","v":""},{"$f":"IF(SUMIFS('07 PDR'!$F$4:$F$5600,'07 PDR'!$A$4:$A$5600,'05 CPD'!$A30,'07 PDR'!$K$4:$K$5600,'05 CPD'!L$2)=0,\"\",SUMIFS('07 PDR'!$F$4:$F$5600,'07 PDR'!$A$4:$A$5600,'05 CPD'!$A30,'07 PDR'!$K$4:$K$5600,'05 CPD'!L$2))","v":""},{"$f":"IF(SUMIFS('07 PDR'!$F$4:$F$5600,'07 PDR'!$A$4:$A$5600,'05 CPD'!$A30,'07 PDR'!$K$4:$K$5600,'05 CPD'!M$2)=0,\"\",SUMIFS('07 PDR'!$F$4:$F$5600,'07 PDR'!$A$4:$A$5600,'05 CPD'!$A30,'07 PDR'!$K$4:$K$5600,'05 CPD'!M$2))","v":""},{"$f":"IF(SUMIFS('07 PDR'!$F$4:$F$5600,'07 PDR'!$A$4:$A$5600,'05 CPD'!$A30,'07 PDR'!$K$4:$K$5600,'05 CPD'!N$2)=0,\"\",SUMIFS('07 PDR'!$F$4:$F$5600,'07 PDR'!$A$4:$A$5600,'05 CPD'!$A30,'07 PDR'!$K$4:$K$5600,'05 CPD'!N$2))","v":""},{"$f":"IF(SUMIFS('07 PDR'!$F$4:$F$5600,'07 PDR'!$A$4:$A$5600,'05 CPD'!$A30,'07 PDR'!$K$4:$K$5600,'05 CPD'!O$2)=0,\"\",SUMIFS('07 PDR'!$F$4:$F$5600,'07 PDR'!$A$4:$A$5600,'05 CPD'!$A30,'07 PDR'!$K$4:$K$5600,'05 CPD'!O$2))","v":""},{"$f":"IF(SUMIFS('07 PDR'!$F$4:$F$5600,'07 PDR'!$A$4:$A$5600,'05 CPD'!$A30,'07 PDR'!$K$4:$K$5600,'05 CPD'!P$2)=0,\"\",SUMIFS('07 PDR'!$F$4:$F$5600,'07 PDR'!$A$4:$A$5600,'05 CPD'!$A30,'07 PDR'!$K$4:$K$5600,'05 CPD'!P$2))","v":""},{"$f":"IF(SUMIFS('07 PDR'!$F$4:$F$5600,'07 PDR'!$A$4:$A$5600,'05 CPD'!$A30,'07 PDR'!$K$4:$K$5600,'05 CPD'!Q$2)=0,\"\",SUMIFS('07 PDR'!$F$4:$F$5600,'07 PDR'!$A$4:$A$5600,'05 CPD'!$A30,'07 PDR'!$K$4:$K$5600,'05 CPD'!Q$2))","v":""},{"$f":"IF(SUMIFS('07 PDR'!$F$4:$F$5600,'07 PDR'!$A$4:$A$5600,'05 CPD'!$A30,'07 PDR'!$K$4:$K$5600,'05 CPD'!R$2)=0,\"\",SUMIFS('07 PDR'!$F$4:$F$5600,'07 PDR'!$A$4:$A$5600,'05 CPD'!$A30,'07 PDR'!$K$4:$K$5600,'05 CPD'!R$2))","v":""},null,{"$f":"IF(SUMIFS('07 PDR'!$F$4:$F$5600,'07 PDR'!$A$4:$A$5600,'05 CPD'!$A30,'07 PDR'!$L$4:$L$5600,'05 CPD'!T$2)=0,\"\",SUMIFS('07 PDR'!$F$4:$F$5600,'07 PDR'!$A$4:$A$5600,'05 CPD'!$A30,'07 PDR'!$L$4:$L$5600,'05 CPD'!T$2))","v":""},{"$f":"IF(SUMIFS('07 PDR'!$F$4:$F$5600,'07 PDR'!$A$4:$A$5600,'05 CPD'!$A30,'07 PDR'!$L$4:$L$5600,'05 CPD'!U$2)=0,\"\",SUMIFS('07 PDR'!$F$4:$F$5600,'07 PDR'!$A$4:$A$5600,'05 CPD'!$A30,'07 PDR'!$L$4:$L$5600,'05 CPD'!U$2))","v":""},{"$f":"IF(SUMIFS('07 PDR'!$F$4:$F$5600,'07 PDR'!$A$4:$A$5600,'05 CPD'!$A30,'07 PDR'!$L$4:$L$5600,'05 CPD'!V$2)=0,\"\",SUMIFS('07 PDR'!$F$4:$F$5600,'07 PDR'!$A$4:$A$5600,'05 CPD'!$A30,'07 PDR'!$L$4:$L$5600,'05 CPD'!V$2))","v":""},{"$f":"IF(SUMIFS('07 PDR'!$F$4:$F$5600,'07 PDR'!$A$4:$A$5600,'05 CPD'!$A30,'07 PDR'!$L$4:$L$5600,'05 CPD'!W$2)=0,\"\",SUMIFS('07 PDR'!$F$4:$F$5600,'07 PDR'!$A$4:$A$5600,'05 CPD'!$A30,'07 PDR'!$L$4:$L$5600,'05 CPD'!W$2))","v":""},{"$f":"IF(SUMIFS('07 PDR'!$F$4:$F$5600,'07 PDR'!$A$4:$A$5600,'05 CPD'!$A30,'07 PDR'!$L$4:$L$5600,'05 CPD'!X$2)=0,\"\",SUMIFS('07 PDR'!$F$4:$F$5600,'07 PDR'!$A$4:$A$5600,'05 CPD'!$A30,'07 PDR'!$L$4:$L$5600,'05 CPD'!X$2))","v":""},{"$f":"IF(SUMIFS('07 PDR'!$F$4:$F$5600,'07 PDR'!$A$4:$A$5600,'05 CPD'!$A30,'07 PDR'!$L$4:$L$5600,'05 CPD'!Y$2)=0,\"\",SUMIFS('07 PDR'!$F$4:$F$5600,'07 PDR'!$A$4:$A$5600,'05 CPD'!$A30,'07 PDR'!$L$4:$L$5600,'05 CPD'!Y$2))","v":""},{"$f":"IF(SUMIFS('07 PDR'!$F$4:$F$5600,'07 PDR'!$A$4:$A$5600,'05 CPD'!$A30,'07 PDR'!$L$4:$L$5600,'05 CPD'!Z$2)=0,\"\",SUMIFS('07 PDR'!$F$4:$F$5600,'07 PDR'!$A$4:$A$5600,'05 CPD'!$A30,'07 PDR'!$L$4:$L$5600,'05 CPD'!Z$2))","v":""},{"$f":"IF(SUMIFS('07 PDR'!$F$4:$F$5600,'07 PDR'!$A$4:$A$5600,'05 CPD'!$A30,'07 PDR'!$L$4:$L$5600,'05 CPD'!AA$2)=0,\"\",SUMIFS('07 PDR'!$F$4:$F$5600,'07 PDR'!$A$4:$A$5600,'05 CPD'!$A30,'07 PDR'!$L$4:$L$5600,'05 CPD'!AA$2))","v":""},{"$f":"IF(SUMIFS('07 PDR'!$F$4:$F$5600,'07 PDR'!$A$4:$A$5600,'05 CPD'!$A30,'07 PDR'!$L$4:$L$5600,'05 CPD'!AB$2)=0,\"\",SUMIFS('07 PDR'!$F$4:$F$5600,'07 PDR'!$A$4:$A$5600,'05 CPD'!$A30,'07 PDR'!$L$4:$L$5600,'05 CPD'!AB$2))","v":""},{"$f":"IF(SUMIFS('07 PDR'!$F$4:$F$5600,'07 PDR'!$A$4:$A$5600,'05 CPD'!$A30,'07 PDR'!$L$4:$L$5600,'05 CPD'!AC$2)=0,\"\",SUMIFS('07 PDR'!$F$4:$F$5600,'07 PDR'!$A$4:$A$5600,'05 CPD'!$A30,'07 PDR'!$L$4:$L$5600,'05 CPD'!AC$2))","v":""},{"$f":"IF(SUMIFS('07 PDR'!$F$4:$F$5600,'07 PDR'!$A$4:$A$5600,'05 CPD'!$A30,'07 PDR'!$L$4:$L$5600,'05 CPD'!AD$2)=0,\"\",SUMIFS('07 PDR'!$F$4:$F$5600,'07 PDR'!$A$4:$A$5600,'05 CPD'!$A30,'07 PDR'!$L$4:$L$5600,'05 CPD'!AD$2))","v":""},{"$f":"IF(SUMIFS('07 PDR'!$F$4:$F$5600,'07 PDR'!$A$4:$A$5600,'05 CPD'!$A30,'07 PDR'!$L$4:$L$5600,'05 CPD'!AE$2)=0,\"\",SUMIFS('07 PDR'!$F$4:$F$5600,'07 PDR'!$A$4:$A$5600,'05 CPD'!$A30,'07 PDR'!$L$4:$L$5600,'05 CPD'!AE$2))","v":""},{"$f":"IF(SUMIFS('07 PDR'!$F$4:$F$5600,'07 PDR'!$A$4:$A$5600,'05 CPD'!$A30,'07 PDR'!$L$4:$L$5600,'05 CPD'!AF$2)=0,\"\",SUMIFS('07 PDR'!$F$4:$F$5600,'07 PDR'!$A$4:$A$5600,'05 CPD'!$A30,'07 PDR'!$L$4:$L$5600,'05 CPD'!AF$2))","v":""}]
["<Insert Period Range for Period 29>","","","",null,null,null,{"$f":"IF(SUMIFS('07 PDR'!$F$4:$F$5600,'07 PDR'!$A$4:$A$5600,'05 CPD'!$A31,'07 PDR'!$K$4:$K$5600,'05 CPD'!H$2)=0,\"\",SUMIFS('07 PDR'!$F$4:$F$5600,'07 PDR'!$A$4:$A$5600,'05 CPD'!$A31,'07 PDR'!$K$4:$K$5600,'05 CPD'!H$2))","v":""},{"$f":"IF(SUMIFS('07 PDR'!$F$4:$F$5600,'07 PDR'!$A$4:$A$5600,'05 CPD'!$A31,'07 PDR'!$K$4:$K$5600,'05 CPD'!I$2)=0,\"\",SUMIFS('07 PDR'!$F$4:$F$5600,'07 PDR'!$A$4:$A$5600,'05 CPD'!$A31,'07 PDR'!$K$4:$K$5600,'05 CPD'!I$2))","v":""},{"$f":"IF(SUMIFS('07 PDR'!$F$4:$F$5600,'07 PDR'!$A$4:$A$5600,'05 CPD'!$A31,'07 PDR'!$K$4:$K$5600,'05 CPD'!J$2)=0,\"\",SUMIFS('07 PDR'!$F$4:$F$5600,'07 PDR'!$A$4:$A$5600,'05 CPD'!$A31,'07 PDR'!$K$4:$K$5600,'05 CPD'!J$2))","v":""},{"$f":"IF(SUMIFS('07 PDR'!$F$4:$F$5600,'07 PDR'!$A$4:$A$5600,'05 CPD'!$A31,'07 PDR'!$K$4:$K$5600,'05 CPD'!K$2)=0,\"\",SUMIFS('07 PDR'!$F$4:$F$5600,'07 PDR'!$A$4:$A$5600,'05 CPD'!$A31,'07 PDR'!$K$4:$K$5600,'05 CPD'!K$2))","v":""},{"$f":"IF(SUMIFS('07 PDR'!$F$4:$F$5600,'07 PDR'!$A$4:$A$5600,'05 CPD'!$A31,'07 PDR'!$K$4:$K$5600,'05 CPD'!L$2)=0,\"\",SUMIFS('07 PDR'!$F$4:$F$5600,'07 PDR'!$A$4:$A$5600,'05 CPD'!$A31,'07 PDR'!$K$4:$K$5600,'05 CPD'!L$2))","v":""},{"$f":"IF(SUMIFS('07 PDR'!$F$4:$F$5600,'07 PDR'!$A$4:$A$5600,'05 CPD'!$A31,'07 PDR'!$K$4:$K$5600,'05 CPD'!M$2)=0,\"\",SUMIFS('07 PDR'!$F$4:$F$5600,'07 PDR'!$A$4:$A$5600,'05 CPD'!$A31,'07 PDR'!$K$4:$K$5600,'05 CPD'!M$2))","v":""},{"$f":"IF(SUMIFS('07 PDR'!$F$4:$F$5600,'07 PDR'!$A$4:$A$5600,'05 CPD'!$A31,'07 PDR'!$K$4:$K$5600,'05 CPD'!N$2)=0,\"\",SUMIFS('07 PDR'!$F$4:$F$5600,'07 PDR'!$A$4:$A$5600,'05 CPD'!$A31,'07 PDR'!$K$4:$K$5600,'05 CPD'!N$2))","v":""},{"$f":"IF(SUMIFS('07 PDR'!$F$4:$F$5600,'07 PDR'!$A$4:$A$5600,'05 CPD'!$A31,'07 PDR'!$K$4:$K$5600,'05 CPD'!O$2)=0,\"\",SUMIFS('07 PDR'!$F$4:$F$5600,'07 PDR'!$A$4:$A$5600,'05 CPD'!$A31,'07 PDR'!$K$4:$K$5600,'05 CPD'!O$2))","v":""},{"$f":"IF(SUMIFS('07 PDR'!$F$4:$F$5600,'07 PDR'!$A$4:$A$5600,'05 CPD'!$A31,'07 PDR'!$K$4:$K$5600,'05 CPD'!P$2)=0,\"\",SUMIFS('07 PDR'!$F$4:$F$5600,'07 PDR'!$A$4:$A$5600,'05 CPD'!$A31,'07 PDR'!$K$4:$K$5600,'05 CPD'!P$2))","v":""},{"$f":"IF(SUMIFS('07 PDR'!$F$4:$F$5600,'07 PDR'!$A$4:$A$5600,'05 CPD'!$A31,'07 PDR'!$K$4:$K$5600,'05 CPD'!Q$2)=0,\"\",SUMIFS('07 PDR'!$F$4:$F$5600,'07 PDR'!$A$4:$A$5600,'05 CPD'!$A31,'07 PDR'!$K$4:$K$5600,'05 CPD'!Q$2))","v":""},{"$f":"IF(SUMIFS('07 PDR'!$F$4:$F$5600,'07 PDR'!$A$4:$A$5600,'05 CPD'!$A31,'07 PDR'!$K$4:$K$5600,'05 CPD'!R$2)=0,\"\",SUMIFS('07 PDR'!$F$4:$F$5600,'07 PDR'!$A$4:$A$5600,'05 CPD'!$A31,'07 PDR'!$K$4:$K$5600,'05 CPD'!R$2))","v":""},null,{"$f":"IF(SUMIFS('07 PDR'!$F$4:$F$5600,'07 PDR'!$A$4:$A$5600,'05 CPD'!$A31,'07 PDR'!$L$4:$L$5600,'05 CPD'!T$2)=0,\"\",SUMIFS('07 PDR'!$F$4:$F$5600,'07 PDR'!$A$4:$A$5600,'05 CPD'!$A31,'07 PDR'!$L$4:$L$5600,'05 CPD'!T$2))","v":""},{"$f":"IF(SUMIFS('07 PDR'!$F$4:$F$5600,'07 PDR'!$A$4:$A$5600,'05 CPD'!$A31,'07 PDR'!$L$4:$L$5600,'05 CPD'!U$2)=0,\"\",SUMIFS('07 PDR'!$F$4:$F$5600,'07 PDR'!$A$4:$A$5600,'05 CPD'!$A31,'07 PDR'!$L$4:$L$5600,'05 CPD'!U$2))","v":""},{"$f":"IF(SUMIFS('07 PDR'!$F$4:$F$5600,'07 PDR'!$A$4:$A$5600,'05 CPD'!$A31,'07 PDR'!$L$4:$L$5600,'05 CPD'!V$2)=0,\"\",SUMIFS('07 PDR'!$F$4:$F$5600,'07 PDR'!$A$4:$A$5600,'05 CPD'!$A31,'07 PDR'!$L$4:$L$5600,'05 CPD'!V$2))","v":""},{"$f":"IF(SUMIFS('07 PDR'!$F$4:$F$5600,'07 PDR'!$A$4:$A$5600,'05 CPD'!$A31,'07 PDR'!$L$4:$L$5600,'05 CPD'!W$2)=0,\"\",SUMIFS('07 PDR'!$F$4:$F$5600,'07 PDR'!$A$4:$A$5600,'05 CPD'!$A31,'07 PDR'!$L$4:$L$5600,'05 CPD'!W$2))","v":""},{"$f":"IF(SUMIFS('07 PDR'!$F$4:$F$5600,'07 PDR'!$A$4:$A$5600,'05 CPD'!$A31,'07 PDR'!$L$4:$L$5600,'05 CPD'!X$2)=0,\"\",SUMIFS('07 PDR'!$F$4:$F$5600,'07 PDR'!$A$4:$A$5600,'05 CPD'!$A31,'07 PDR'!$L$4:$L$5600,'05 CPD'!X$2))","v":""},{"$f":"IF(SUMIFS('07 PDR'!$F$4:$F$5600,'07 PDR'!$A$4:$A$5600,'05 CPD'!$A31,'07 PDR'!$L$4:$L$5600,'05 CPD'!Y$2)=0,\"\",SUMIFS('07 PDR'!$F$4:$F$5600,'07 PDR'!$A$4:$A$5600,'05 CPD'!$A31,'07 PDR'!$L$4:$L$5600,'05 CPD'!Y$2))","v":""},{"$f":"IF(SUMIFS('07 PDR'!$F$4:$F$5600,'07 PDR'!$A$4:$A$5600,'05 CPD'!$A31,'07 PDR'!$L$4:$L$5600,'05 CPD'!Z$2)=0,\"\",SUMIFS('07 PDR'!$F$4:$F$5600,'07 PDR'!$A$4:$A$5600,'05 CPD'!$A31,'07 PDR'!$L$4:$L$5600,'05 CPD'!Z$2))","v":""},{"$f":"IF(SUMIFS('07 PDR'!$F$4:$F$5600,'07 PDR'!$A$4:$A$5600,'05 CPD'!$A31,'07 PDR'!$L$4:$L$5600,'05 CPD'!AA$2)=0,\"\",SUMIFS('07 PDR'!$F$4:$F$5600,'07 PDR'!$A$4:$A$5600,'05 CPD'!$A31,'07 PDR'!$L$4:$L$5600,'05 CPD'!AA$2))","v":""},{"$f":"IF(SUMIFS('07 PDR'!$F$4:$F$5600,'07 PDR'!$A$4:$A$5600,'05 CPD'!$A31,'07 PDR'!$L$4:$L$5600,'05 CPD'!AB$2)=0,\"\",SUMIFS('07 PDR'!$F$4:$F$5600,'07 PDR'!$A$4:$A$5600,'05 CPD'!$A31,'07 PDR'!$L$4:$L$5600,'05 CPD'!AB$2))","v":""},{"$f":"IF(SUMIFS('07 PDR'!$F$4:$F$5600,'07 PDR'!$A$4:$A$5600,'05 CPD'!$A31,'07 PDR'!$L$4:$L$5600,'05 CPD'!AC$2)=0,\"\",SUMIFS('07 PDR'!$F$4:$F$5600,'07 PDR'!$A$4:$A$5600,'05 CPD'!$A31,'07 PDR'!$L$4:$L$5600,'05 CPD'!AC$2))","v":""},{"$f":"IF(SUMIFS('07 PDR'!$F$4:$F$5600,'07 PDR'!$A$4:$A$5600,'05 CPD'!$A31,'07 PDR'!$L$4:$L$5600,'05 CPD'!AD$2)=0,\"\",SUMIFS('07 PDR'!$F$4:$F$5600,'07 PDR'!$A$4:$A$5600,'05 CPD'!$A31,'07 PDR'!$L$4:$L$5600,'05 CPD'!AD$2))","v":""},{"$f":"IF(SUMIFS('07 PDR'!$F$4:$F$5600,'07 PDR'!$A$4:$A$5600,'05 CPD'!$A31,'07 PDR'!$L$4:$L$5600,'05 CPD'!AE$2)=0,\"\",SUMIFS('07 PDR'!$F$4:$F$5600,'07 PDR'!$A$4:$A$5600,'05 CPD'!$A31,'07 PDR'!$L$4:$L$5600,'05 CPD'!AE$2))","v":""},{"$f":"IF(SUMIFS('07 PDR'!$F$4:$F$5600,'07 PDR'!$A$4:$A$5600,'05 CPD'!$A31,'07 PDR'!$L$4:$L$5600,'05 CPD'!AF$2)=0,\"\",SUMIFS('07 PDR'!$F$4:$F$5600,'07 PDR'!$A$4:$A$5600,'05 CPD'!$A31,'07 PDR'!$L$4:$L$5600,'05 CPD'!AF$2))","v":""}]
["<Insert Period Range for Period 30>","","","",null,null,null,{"$f":"IF(SUMIFS('07 PDR'!$F$4:$F$5600,'07 PDR'!$A$4:$A$5600,'05 CPD'!$A32,'07 PDR'!$K$4:$K$5600,'05 CPD'!H$2)=0,\"\",SUMIFS('07 PDR'!$F$4:$F$5600,'07 PDR'!$A$4:$A$5600,'05 CPD'!$A32,'07 PDR'!$K$4:$K$5600,'05 CPD'!H$2))","v":""},{"$f":"IF(SUMIFS('07 PDR'!$F$4:$F$5600,'07 PDR'!$A$4:$A$5600,'05 CPD'!$A32,'07 PDR'!$K$4:$K$5600,'05 CPD'!I$2)=0,\"\",SUMIFS('07 PDR'!$F$4:$F$5600,'07 PDR'!$A$4:$A$5600,'05 CPD'!$A32,'07 PDR'!$K$4:$K$5600,'05 CPD'!I$2))","v":""},{"$f":"IF(SUMIFS('07 PDR'!$F$4:$F$5600,'07 PDR'!$A$4:$A$5600,'05 CPD'!$A32,'07 PDR'!$K$4:$K$5600,'05 CPD'!J$2)=0,\"\",SUMIFS('07 PDR'!$F$4:$F$5600,'07 PDR'!$A$4:$A$5600,'05 CPD'!$A32,'07 PDR'!$K$4:$K$5600,'05 CPD'!J$2))","v":""},{"$f":"IF(SUMIFS('07 PDR'!$F$4:$F$5600,'07 PDR'!$A$4:$A$5600,'05 CPD'!$A32,'07 PDR'!$K$4:$K$5600,'05 CPD'!K$2)=0,\"\",SUMIFS('07 PDR'!$F$4:$F$5600,'07 PDR'!$A$4:$A$5600,'05 CPD'!$A32,'07 PDR'!$K$4:$K$5600,'05 CPD'!K$2))","v":""},{"$f":"IF(SUMIFS('07 PDR'!$F$4:$F$5600,'07 PDR'!$A$4:$A$5600,'05 CPD'!$A32,'07 PDR'!$K$4:$K$5600,'05 CPD'!L$2)=0,\"\",SUMIFS('07 PDR'!$F$4:$F$5600,'07 PDR'!$A$4:$A$5600,'05 CPD'!$A32,'07 PDR'!$K$4:$K$5600,'05 CPD'!L$2))","v":""},{"$f":"IF(SUMIFS('07 PDR'!$F$4:$F$5600,'07 PDR'!$A$4:$A$5600,'05 CPD'!$A32,'07 PDR'!$K$4:$K$5600,'05 CPD'!M$2)=0,\"\",SUMIFS('07 PDR'!$F$4:$F$5600,'07 PDR'!$A$4:$A$5600,'05 CPD'!$A32,'07 PDR'!$K$4:$K$5600,'05 CPD'!M$2))","v":""},{"$f":"IF(SUMIFS('07 PDR'!$F$4:$F$5600,'07 PDR'!$A$4:$A$5600,'05 CPD'!$A32,'07 PDR'!$K$4:$K$5600,'05 CPD'!N$2)=0,\"\",SUMIFS('07 PDR'!$F$4:$F$5600,'07 PDR'!$A$4:$A$5600,'05 CPD'!$A32,'07 PDR'!$K$4:$K$5600,'05 CPD'!N$2))","v":""},{"$f":"IF(SUMIFS('07 PDR'!$F$4:$F$5600,'07 PDR'!$A$4:$A$5600,'05 CPD'!$A32,'07 PDR'!$K$4:$K$5600,'05 CPD'!O$2)=0,\"\",SUMIFS('07 PDR'!$F$4:$F$5600,'07 PDR'!$A$4:$A$5600,'05 CPD'!$A32,'07 PDR'!$K$4:$K$5600,'05 CPD'!O$2))","v":""},{"$f":"IF(SUMIFS('07 PDR'!$F$4:$F$5600,'07 PDR'!$A$4:$A$5600,'05 CPD'!$A32,'07 PDR'!$K$4:$K$5600,'05 CPD'!P$2)=0,\"\",SUMIFS('07 PDR'!$F$4:$F$5600,'07 PDR'!$A$4:$A$5600,'05 CPD'!$A32,'07 PDR'!$K$4:$K$5600,'05 CPD'!P$2))","v":""},{"$f":"IF(SUMIFS('07 PDR'!$F$4:$F$5600,'07 PDR'!$A$4:$A$5600,'05 CPD'!$A32,'07 PDR'!$K$4:$K$5600,'05 CPD'!Q$2)=0,\"\",SUMIFS('07 PDR'!$F$4:$F$5600,'07 PDR'!$A$4:$A$5600,'05 CPD'!$A32,'07 PDR'!$K$4:$K$5600,'05 CPD'!Q$2))","v":""},{"$f":"IF(SUMIFS('07 PDR'!$F$4:$F$5600,'07 PDR'!$A$4:$A$5600,'05 CPD'!$A32,'07 PDR'!$K$4:$K$5600,'05 CPD'!R$2)=0,\"\",SUMIFS('07 PDR'!$F$4:$F$5600,'07 PDR'!$A$4:$A$5600,'05 CPD'!$A32,'07 PDR'!$K$4:$K$5600,'05 CPD'!R$2))","v":""},null,{"$f":"IF(SUMIFS('07 PDR'!$F$4:$F$5600,'07 PDR'!$A$4:$A$5600,'05 CPD'!$A32,'07 PDR'!$L$4:$L$5600,'05 CPD'!T$2)=0,\"\",SUMIFS('07 PDR'!$F$4:$F$5600,'07 PDR'!$A$4:$A$5600,'05 CPD'!$A32,'07 PDR'!$L$4:$L$5600,'05 CPD'!T$2))","v":""},{"$f":"IF(SUMIFS('07 PDR'!$F$4:$F$5600,'07 PDR'!$A$4:$A$5600,'05 CPD'!$A32,'07 PDR'!$L$4:$L$5600,'05 CPD'!U$2)=0,\"\",SUMIFS('07 PDR'!$F$4:$F$5600,'07 PDR'!$A$4:$A$5600,'05 CPD'!$A32,'07 PDR'!$L$4:$L$5600,'05 CPD'!U$2))","v":""},{"$f":"IF(SUMIFS('07 PDR'!$F$4:$F$5600,'07 PDR'!$A$4:$A$5600,'05 CPD'!$A32,'07 PDR'!$L$4:$L$5600,'05 CPD'!V$2)=0,\"\",SUMIFS('07 PDR'!$F$4:$F$5600,'07 PDR'!$A$4:$A$5600,'05 CPD'!$A32,'07 PDR'!$L$4:$L$5600,'05 CPD'!V$2))","v":""},{"$f":"IF(SUMIFS('07 PDR'!$F$4:$F$5600,'07 PDR'!$A$4:$A$5600,'05 CPD'!$A32,'07 PDR'!$L$4:$L$5600,'05 CPD'!W$2)=0,\"\",SUMIFS('07 PDR'!$F$4:$F$5600,'07 PDR'!$A$4:$A$5600,'05 CPD'!$A32,'07 PDR'!$L$4:$L$5600,'05 CPD'!W$2))","v":""},{"$f":"IF(SUMIFS('07 PDR'!$F$4:$F$5600,'07 PDR'!$A$4:$A$5600,'05 CPD'!$A32,'07 PDR'!$L$4:$L$5600,'05 CPD'!X$2)=0,\"\",SUMIFS('07 PDR'!$F$4:$F$5600,'07 PDR'!$A$4:$A$5600,'05 CPD'!$A32,'07 PDR'!$L$4:$L$5600,'05 CPD'!X$2))","v":""},{"$f":"IF(SUMIFS('07 PDR'!$F$4:$F$5600,'07 PDR'!$A$4:$A$5600,'05 CPD'!$A32,'07 PDR'!$L$4:$L$5600,'05 CPD'!Y$2)=0,\"\",SUMIFS('07 PDR'!$F$4:$F$5600,'07 PDR'!$A$4:$A$5600,'05 CPD'!$A32,'07 PDR'!$L$4:$L$5600,'05 CPD'!Y$2))","v":""},{"$f":"IF(SUMIFS('07 PDR'!$F$4:$F$5600,'07 PDR'!$A$4:$A$5600,'05 CPD'!$A32,'07 PDR'!$L$4:$L$5600,'05 CPD'!Z$2)=0,\"\",SUMIFS('07 PDR'!$F$4:$F$5600,'07 PDR'!$A$4:$A$5600,'05 CPD'!$A32,'07 PDR'!$L$4:$L$5600,'05 CPD'!Z$2))","v":""},{"$f":"IF(SUMIFS('07 PDR'!$F$4:$F$5600,'07 PDR'!$A$4:$A$5600,'05 CPD'!$A32,'07 PDR'!$L$4:$L$5600,'05 CPD'!AA$2)=0,\"\",SUMIFS('07 PDR'!$F$4:$F$5600,'07 PDR'!$A$4:$A$5600,'05 CPD'!$A32,'07 PDR'!$L$4:$L$5600,'05 CPD'!AA$2))","v":""},{"$f":"IF(SUMIFS('07 PDR'!$F$4:$F$5600,'07 PDR'!$A$4:$A$5600,'05 CPD'!$A32,'07 PDR'!$L$4:$L$5600,'05 CPD'!AB$2)=0,\"\",SUMIFS('07 PDR'!$F$4:$F$5600,'07 PDR'!$A$4:$A$5600,'05 CPD'!$A32,'07 PDR'!$L$4:$L$5600,'05 CPD'!AB$2))","v":""},{"$f":"IF(SUMIFS('07 PDR'!$F$4:$F$5600,'07 PDR'!$A$4:$A$5600,'05 CPD'!$A32,'07 PDR'!$L$4:$L$5600,'05 CPD'!AC$2)=0,\"\",SUMIFS('07 PDR'!$F$4:$F$5600,'07 PDR'!$A$4:$A$5600,'05 CPD'!$A32,'07 PDR'!$L$4:$L$5600,'05 CPD'!AC$2))","v":""},{"$f":"IF(SUMIFS('07 PDR'!$F$4:$F$5600,'07 PDR'!$A$4:$A$5600,'05 CPD'!$A32,'07 PDR'!$L$4:$L$5600,'05 CPD'!AD$2)=0,\"\",SUMIFS('07 PDR'!$F$4:$F$5600,'07 PDR'!$A$4:$A$5600,'05 CPD'!$A32,'07 PDR'!$L$4:$L$5600,'05 CPD'!AD$2))","v":""},{"$f":"IF(SUMIFS('07 PDR'!$F$4:$F$5600,'07 PDR'!$A$4:$A$5600,'05 CPD'!$A32,'07 PDR'!$L$4:$L$5600,'05 CPD'!AE$2)=0,\"\",SUMIFS('07 PDR'!$F$4:$F$5600,'07 PDR'!$A$4:$A$5600,'05 CPD'!$A32,'07 PDR'!$L$4:$L$5600,'05 CPD'!AE$2))","v":""},{"$f":"IF(SUMIFS('07 PDR'!$F$4:$F$5600,'07 PDR'!$A$4:$A$5600,'05 CPD'!$A32,'07 PDR'!$L$4:$L$5600,'05 CPD'!AF$2)=0,\"\",SUMIFS('07 PDR'!$F$4:$F$5600,'07 PDR'!$A$4:$A$5600,'05 CPD'!$A32,'07 PDR'!$L$4:$L$5600,'05 CPD'!AF$2))","v":""}]
["<Insert Period Range for Period 31>","","","",null,null,null,{"$f":"IF(SUMIFS('07 PDR'!$F$4:$F$5600,'07 PDR'!$A$4:$A$5600,'05 CPD'!$A33,'07 PDR'!$K$4:$K$5600,'05 CPD'!H$2)=0,\"\",SUMIFS('07 PDR'!$F$4:$F$5600,'07 PDR'!$A$4:$A$5600,'05 CPD'!$A33,'07 PDR'!$K$4:$K$5600,'05 CPD'!H$2))","v":""},{"$f":"IF(SUMIFS('07 PDR'!$F$4:$F$5600,'07 PDR'!$A$4:$A$5600,'05 CPD'!$A33,'07 PDR'!$K$4:$K$5600,'05 CPD'!I$2)=0,\"\",SUMIFS('07 PDR'!$F$4:$F$5600,'07 PDR'!$A$4:$A$5600,'05 CPD'!$A33,'07 PDR'!$K$4:$K$5600,'05 CPD'!I$2))","v":""},{"$f":"IF(SUMIFS('07 PDR'!$F$4:$F$5600,'07 PDR'!$A$4:$A$5600,'05 CPD'!$A33,'07 PDR'!$K$4:$K$5600,'05 CPD'!J$2)=0,\"\",SUMIFS('07 PDR'!$F$4:$F$5600,'07 PDR'!$A$4:$A$5600,'05 CPD'!$A33,'07 PDR'!$K$4:$K$5600,'05 CPD'!J$2))","v":""},{"$f":"IF(SUMIFS('07 PDR'!$F$4:$F$5600,'07 PDR'!$A$4:$A$5600,'05 CPD'!$A33,'07 PDR'!$K$4:$K$5600,'05 CPD'!K$2)=0,\"\",SUMIFS('07 PDR'!$F$4:$F$5600,'07 PDR'!$A$4:$A$5600,'05 CPD'!$A33,'07 PDR'!$K$4:$K$5600,'05 CPD'!K$2))","v":""},{"$f":"IF(SUMIFS('07 PDR'!$F$4:$F$5600,'07 PDR'!$A$4:$A$5600,'05 CPD'!$A33,'07 PDR'!$K$4:$K$5600,'05 CPD'!L$2)=0,\"\",SUMIFS('07 PDR'!$F$4:$F$5600,'07 PDR'!$A$4:$A$5600,'05 CPD'!$A33,'07 PDR'!$K$4:$K$5600,'05 CPD'!L$2))","v":""},{"$f":"IF(SUMIFS('07 PDR'!$F$4:$F$5600,'07 PDR'!$A$4:$A$5600,'05 CPD'!$A33,'07 PDR'!$K$4:$K$5600,'05 CPD'!M$2)=0,\"\",SUMIFS('07 PDR'!$F$4:$F$5600,'07 PDR'!$A$4:$A$5600,'05 CPD'!$A33,'07 PDR'!$K$4:$K$5600,'05 CPD'!M$2))","v":""},{"$f":"IF(SUMIFS('07 PDR'!$F$4:$F$5600,'07 PDR'!$A$4:$A$5600,'05 CPD'!$A33,'07 PDR'!$K$4:$K$5600,'05 CPD'!N$2)=0,\"\",SUMIFS('07 PDR'!$F$4:$F$5600,'07 PDR'!$A$4:$A$5600,'05 CPD'!$A33,'07 PDR'!$K$4:$K$5600,'05 CPD'!N$2))","v":""},{"$f":"IF(SUMIFS('07 PDR'!$F$4:$F$5600,'07 PDR'!$A$4:$A$5600,'05 CPD'!$A33,'07 PDR'!$K$4:$K$5600,'05 CPD'!O$2)=0,\"\",SUMIFS('07 PDR'!$F$4:$F$5600,'07 PDR'!$A$4:$A$5600,'05 CPD'!$A33,'07 PDR'!$K$4:$K$5600,'05 CPD'!O$2))","v":""},{"$f":"IF(SUMIFS('07 PDR'!$F$4:$F$5600,'07 PDR'!$A$4:$A$5600,'05 CPD'!$A33,'07 PDR'!$K$4:$K$5600,'05 CPD'!P$2)=0,\"\",SUMIFS('07 PDR'!$F$4:$F$5600,'07 PDR'!$A$4:$A$5600,'05 CPD'!$A33,'07 PDR'!$K$4:$K$5600,'05 CPD'!P$2))","v":""},{"$f":"IF(SUMIFS('07 PDR'!$F$4:$F$5600,'07 PDR'!$A$4:$A$5600,'05 CPD'!$A33,'07 PDR'!$K$4:$K$5600,'05 CPD'!Q$2)=0,\"\",SUMIFS('07 PDR'!$F$4:$F$5600,'07 PDR'!$A$4:$A$5600,'05 CPD'!$A33,'07 PDR'!$K$4:$K$5600,'05 CPD'!Q$2))","v":""},{"$f":"IF(SUMIFS('07 PDR'!$F$4:$F$5600,'07 PDR'!$A$4:$A$5600,'05 CPD'!$A33,'07 PDR'!$K$4:$K$5600,'05 CPD'!R$2)=0,\"\",SUMIFS('07 PDR'!$F$4:$F$5600,'07 PDR'!$A$4:$A$5600,'05 CPD'!$A33,'07 PDR'!$K$4:$K$5600,'05 CPD'!R$2))","v":""},null,{"$f":"IF(SUMIFS('07 PDR'!$F$4:$F$5600,'07 PDR'!$A$4:$A$5600,'05 CPD'!$A33,'07 PDR'!$L$4:$L$5600,'05 CPD'!T$2)=0,\"\",SUMIFS('07 PDR'!$F$4:$F$5600,'07 PDR'!$A$4:$A$5600,'05 CPD'!$A33,'07 PDR'!$L$4:$L$5600,'05 CPD'!T$2))","v":""},{"$f":"IF(SUMIFS('07 PDR'!$F$4:$F$5600,'07 PDR'!$A$4:$A$5600,'05 CPD'!$A33,'07 PDR'!$L$4:$L$5600,'05 CPD'!U$2)=0,\"\",SUMIFS('07 PDR'!$F$4:$F$5600,'07 PDR'!$A$4:$A$5600,'05 CPD'!$A33,'07 PDR'!$L$4:$L$5600,'05 CPD'!U$2))","v":""},{"$f":"IF(SUMIFS('07 PDR'!$F$4:$F$5600,'07 PDR'!$A$4:$A$5600,'05 CPD'!$A33,'07 PDR'!$L$4:$L$5600,'05 CPD'!V$2)=0,\"\",SUMIFS('07 PDR'!$F$4:$F$5600,'07 PDR'!$A$4:$A$5600,'05 CPD'!$A33,'07 PDR'!$L$4:$L$5600,'05 CPD'!V$2))","v":""},{"$f":"IF(SUMIFS('07 PDR'!$F$4:$F$5600,'07 PDR'!$A$4:$A$5600,'05 CPD'!$A33,'07 PDR'!$L$4:$L$5600,'05 CPD'!W$2)=0,\"\",SUMIFS('07 PDR'!$F$4:$F$5600,'07 PDR'!$A$4:$A$5600,'05 CPD'!$A33,'07 PDR'!$L$4:$L$5600,'05 CPD'!W$2))","v":""},{"$f":"IF(SUMIFS('07 PDR'!$F$4:$F$5600,'07 PDR'!$A$4:$A$5600,'05 CPD'!$A33,'07 PDR'!$L$4:$L$5600,'05 CPD'!X$2)=0,\"\",SUMIFS('07 PDR'!$F$4:$F$5600,'07 PDR'!$A$4:$A$5600,'05 CPD'!$A33,'07 PDR'!$L$4:$L$5600,'05 CPD'!X$2))","v":""},{"$f":"IF(SUMIFS('07 PDR'!$F$4:$F$5600,'07 PDR'!$A$4:$A$5600,'05 CPD'!$A33,'07 PDR'!$L$4:$L$5600,'05 CPD'!Y$2)=0,\"\",SUMIFS('07 PDR'!$F$4:$F$5600,'07 PDR'!$A$4:$A$5600,'05 CPD'!$A33,'07 PDR'!$L$4:$L$5600,'05 CPD'!Y$2))","v":""},{"$f":"IF(SUMIFS('07 PDR'!$F$4:$F$5600,'07 PDR'!$A$4:$A$5600,'05 CPD'!$A33,'07 PDR'!$L$4:$L$5600,'05 CPD'!Z$2)=0,\"\",SUMIFS('07 PDR'!$F$4:$F$5600,'07 PDR'!$A$4:$A$5600,'05 CPD'!$A33,'07 PDR'!$L$4:$L$5600,'05 CPD'!Z$2))","v":""},{"$f":"IF(SUMIFS('07 PDR'!$F$4:$F$5600,'07 PDR'!$A$4:$A$5600,'05 CPD'!$A33,'07 PDR'!$L$4:$L$5600,'05 CPD'!AA$2)=0,\"\",SUMIFS('07 PDR'!$F$4:$F$5600,'07 PDR'!$A$4:$A$5600,'05 CPD'!$A33,'07 PDR'!$L$4:$L$5600,'05 CPD'!AA$2))","v":""},{"$f":"IF(SUMIFS('07 PDR'!$F$4:$F$5600,'07 PDR'!$A$4:$A$5600,'05 CPD'!$A33,'07 PDR'!$L$4:$L$5600,'05 CPD'!AB$2)=0,\"\",SUMIFS('07 PDR'!$F$4:$F$5600,'07 PDR'!$A$4:$A$5600,'05 CPD'!$A33,'07 PDR'!$L$4:$L$5600,'05 CPD'!AB$2))","v":""},{"$f":"IF(SUMIFS('07 PDR'!$F$4:$F$5600,'07 PDR'!$A$4:$A$5600,'05 CPD'!$A33,'07 PDR'!$L$4:$L$5600,'05 CPD'!AC$2)=0,\"\",SUMIFS('07 PDR'!$F$4:$F$5600,'07 PDR'!$A$4:$A$5600,'05 CPD'!$A33,'07 PDR'!$L$4:$L$5600,'05 CPD'!AC$2))","v":""},{"$f":"IF(SUMIFS('07 PDR'!$F$4:$F$5600,'07 PDR'!$A$4:$A$5600,'05 CPD'!$A33,'07 PDR'!$L$4:$L$5600,'05 CPD'!AD$2)=0,\"\",SUMIFS('07 PDR'!$F$4:$F$5600,'07 PDR'!$A$4:$A$5600,'05 CPD'!$A33,'07 PDR'!$L$4:$L$5600,'05 CPD'!AD$2))","v":""},{"$f":"IF(SUMIFS('07 PDR'!$F$4:$F$5600,'07 PDR'!$A$4:$A$5600,'05 CPD'!$A33,'07 PDR'!$L$4:$L$5600,'05 CPD'!AE$2)=0,\"\",SUMIFS('07 PDR'!$F$4:$F$5600,'07 PDR'!$A$4:$A$5600,'05 CPD'!$A33,'07 PDR'!$L$4:$L$5600,'05 CPD'!AE$2))","v":""},{"$f":"IF(SUMIFS('07 PDR'!$F$4:$F$5600,'07 PDR'!$A$4:$A$5600,'05 CPD'!$A33,'07 PDR'!$L$4:$L$5600,'05 CPD'!AF$2)=0,\"\",SUMIFS('07 PDR'!$F$4:$F$5600,'07 PDR'!$A$4:$A$5600,'05 CPD'!$A33,'07 PDR'!$L$4:$L$5600,'05 CPD'!AF$2))","v":""}]
["<Insert Period Range for Period 32>","","","",null,null,null,{"$f":"IF(SUMIFS('07 PDR'!$F$4:$F$5600,'07 PDR'!$A$4:$A$5600,'05 CPD'!$A34,'07 PDR'!$K$4:$K$5600,'05 CPD'!H$2)=0,\"\",SUMIFS('07 PDR'!$F$4:$F$5600,'07 PDR'!$A$4:$A$5600,'05 CPD'!$A34,'07 PDR'!$K$4:$K$5600,'05 CPD'!H$2))","v":""},{"$f":"IF(SUMIFS('07 PDR'!$F$4:$F$5600,'07 PDR'!$A$4:$A$5600,'05 CPD'!$A34,'07 PDR'!$K$4:$K$5600,'05 CPD'!I$2)=0,\"\",SUMIFS('07 PDR'!$F$4:$F$5600,'07 PDR'!$A$4:$A$5600,'05 CPD'!$A34,'07 PDR'!$K$4:$K$5600,'05 CPD'!I$2))","v":""},{"$f":"IF(SUMIFS('07 PDR'!$F$4:$F$5600,'07 PDR'!$A$4:$A$5600,'05 CPD'!$A34,'07 PDR'!$K$4:$K$5600,'05 CPD'!J$2)=0,\"\",SUMIFS('07 PDR'!$F$4:$F$5600,'07 PDR'!$A$4:$A$5600,'05 CPD'!$A34,'07 PDR'!$K$4:$K$5600,'05 CPD'!J$2))","v":""},{"$f":"IF(SUMIFS('07 PDR'!$F$4:$F$5600,'07 PDR'!$A$4:$A$5600,'05 CPD'!$A34,'07 PDR'!$K$4:$K$5600,'05 CPD'!K$2)=0,\"\",SUMIFS('07 PDR'!$F$4:$F$5600,'07 PDR'!$A$4:$A$5600,'05 CPD'!$A34,'07 PDR'!$K$4:$K$5600,'05 CPD'!K$2))","v":""},{"$f":"IF(SUMIFS('07 PDR'!$F$4:$F$5600,'07 PDR'!$A$4:$A$5600,'05 CPD'!$A34,'07 PDR'!$K$4:$K$5600,'05 CPD'!L$2)=0,\"\",SUMIFS('07 PDR'!$F$4:$F$5600,'07 PDR'!$A$4:$A$5600,'05 CPD'!$A34,'07 PDR'!$K$4:$K$5600,'05 CPD'!L$2))","v":""},{"$f":"IF(SUMIFS('07 PDR'!$F$4:$F$5600,'07 PDR'!$A$4:$A$5600,'05 CPD'!$A34,'07 PDR'!$K$4:$K$5600,'05 CPD'!M$2)=0,\"\",SUMIFS('07 PDR'!$F$4:$F$5600,'07 PDR'!$A$4:$A$5600,'05 CPD'!$A34,'07 PDR'!$K$4:$K$5600,'05 CPD'!M$2))","v":""},{"$f":"IF(SUMIFS('07 PDR'!$F$4:$F$5600,'07 PDR'!$A$4:$A$5600,'05 CPD'!$A34,'07 PDR'!$K$4:$K$5600,'05 CPD'!N$2)=0,\"\",SUMIFS('07 PDR'!$F$4:$F$5600,'07 PDR'!$A$4:$A$5600,'05 CPD'!$A34,'07 PDR'!$K$4:$K$5600,'05 CPD'!N$2))","v":""},{"$f":"IF(SUMIFS('07 PDR'!$F$4:$F$5600,'07 PDR'!$A$4:$A$5600,'05 CPD'!$A34,'07 PDR'!$K$4:$K$5600,'05 CPD'!O$2)=0,\"\",SUMIFS('07 PDR'!$F$4:$F$5600,'07 PDR'!$A$4:$A$5600,'05 CPD'!$A34,'07 PDR'!$K$4:$K$5600,'05 CPD'!O$2))","v":""},{"$f":"IF(SUMIFS('07 PDR'!$F$4:$F$5600,'07 PDR'!$A$4:$A$5600,'05 CPD'!$A34,'07 PDR'!$K$4:$K$5600,'05 CPD'!P$2)=0,\"\",SUMIFS('07 PDR'!$F$4:$F$5600,'07 PDR'!$A$4:$A$5600,'05 CPD'!$A34,'07 PDR'!$K$4:$K$5600,'05 CPD'!P$2))","v":""},{"$f":"IF(SUMIFS('07 PDR'!$F$4:$F$5600,'07 PDR'!$A$4:$A$5600,'05 CPD'!$A34,'07 PDR'!$K$4:$K$5600,'05 CPD'!Q$2)=0,\"\",SUMIFS('07 PDR'!$F$4:$F$5600,'07 PDR'!$A$4:$A$5600,'05 CPD'!$A34,'07 PDR'!$K$4:$K$5600,'05 CPD'!Q$2))","v":""},{"$f":"IF(SUMIFS('07 PDR'!$F$4:$F$5600,'07 PDR'!$A$4:$A$5600,'05 CPD'!$A34,'07 PDR'!$K$4:$K$5600,'05 CPD'!R$2)=0,\"\",SUMIFS('07 PDR'!$F$4:$F$5600,'07 PDR'!$A$4:$A$5600,'05 CPD'!$A34,'07 PDR'!$K$4:$K$5600,'05 CPD'!R$2))","v":""},null,{"$f":"IF(SUMIFS('07 PDR'!$F$4:$F$5600,'07 PDR'!$A$4:$A$5600,'05 CPD'!$A34,'07 PDR'!$L$4:$L$5600,'05 CPD'!T$2)=0,\"\",SUMIFS('07 PDR'!$F$4:$F$5600,'07 PDR'!$A$4:$A$5600,'05 CPD'!$A34,'07 PDR'!$L$4:$L$5600,'05 CPD'!T$2))","v":""},{"$f":"IF(SUMIFS('07 PDR'!$F$4:$F$5600,'07 PDR'!$A$4:$A$5600,'05 CPD'!$A34,'07 PDR'!$L$4:$L$5600,'05 CPD'!U$2)=0,\"\",SUMIFS('07 PDR'!$F$4:$F$5600,'07 PDR'!$A$4:$A$5600,'05 CPD'!$A34,'07 PDR'!$L$4:$L$5600,'05 CPD'!U$2))","v":""},{"$f":"IF(SUMIFS('07 PDR'!$F$4:$F$5600,'07 PDR'!$A$4:$A$5600,'05 CPD'!$A34,'07 PDR'!$L$4:$L$5600,'05 CPD'!V$2)=0,\"\",SUMIFS('07 PDR'!$F$4:$F$5600,'07 PDR'!$A$4:$A$5600,'05 CPD'!$A34,'07 PDR'!$L$4:$L$5600,'05 CPD'!V$2))","v":""},{"$f":"IF(SUMIFS('07 PDR'!$F$4:$F$5600,'07 PDR'!$A$4:$A$5600,'05 CPD'!$A34,'07 PDR'!$L$4:$L$5600,'05 CPD'!W$2)=0,\"\",SUMIFS('07 PDR'!$F$4:$F$5600,'07 PDR'!$A$4:$A$5600,'05 CPD'!$A34,'07 PDR'!$L$4:$L$5600,'05 CPD'!W$2))","v":""},{"$f":"IF(SUMIFS('07 PDR'!$F$4:$F$5600,'07 PDR'!$A$4:$A$5600,'05 CPD'!$A34,'07 PDR'!$L$4:$L$5600,'05 CPD'!X$2)=0,\"\",SUMIFS('07 PDR'!$F$4:$F$5600,'07 PDR'!$A$4:$A$5600,'05 CPD'!$A34,'07 PDR'!$L$4:$L$5600,'05 CPD'!X$2))","v":""},{"$f":"IF(SUMIFS('07 PDR'!$F$4:$F$5600,'07 PDR'!$A$4:$A$5600,'05 CPD'!$A34,'07 PDR'!$L$4:$L$5600,'05 CPD'!Y$2)=0,\"\",SUMIFS('07 PDR'!$F$4:$F$5600,'07 PDR'!$A$4:$A$5600,'05 CPD'!$A34,'07 PDR'!$L$4:$L$5600,'05 CPD'!Y$2))","v":""},{"$f":"IF(SUMIFS('07 PDR'!$F$4:$F$5600,'07 PDR'!$A$4:$A$5600,'05 CPD'!$A34,'07 PDR'!$L$4:$L$5600,'05 CPD'!Z$2)=0,\"\",SUMIFS('07 PDR'!$F$4:$F$5600,'07 PDR'!$A$4:$A$5600,'05 CPD'!$A34,'07 PDR'!$L$4:$L$5600,'05 CPD'!Z$2))","v":""},{"$f":"IF(SUMIFS('07 PDR'!$F$4:$F$5600,'07 PDR'!$A$4:$A$5600,'05 CPD'!$A34,'07 PDR'!$L$4:$L$5600,'05 CPD'!AA$2)=0,\"\",SUMIFS('07 PDR'!$F$4:$F$5600,'07 PDR'!$A$4:$A$5600,'05 CPD'!$A34,'07 PDR'!$L$4:$L$5600,'05 CPD'!AA$2))","v":""},{"$f":"IF(SUMIFS('07 PDR'!$F$4:$F$5600,'07 PDR'!$A$4:$A$5600,'05 CPD'!$A34,'07 PDR'!$L$4:$L$5600,'05 CPD'!AB$2)=0,\"\",SUMIFS('07 PDR'!$F$4:$F$5600,'07 PDR'!$A$4:$A$5600,'05 CPD'!$A34,'07 PDR'!$L$4:$L$5600,'05 CPD'!AB$2))","v":""},{"$f":"IF(SUMIFS('07 PDR'!$F$4:$F$5600,'07 PDR'!$A$4:$A$5600,'05 CPD'!$A34,'07 PDR'!$L$4:$L$5600,'05 CPD'!AC$2)=0,\"\",SUMIFS('07 PDR'!$F$4:$F$5600,'07 PDR'!$A$4:$A$5600,'05 CPD'!$A34,'07 PDR'!$L$4:$L$5600,'05 CPD'!AC$2))","v":""},{"$f":"IF(SUMIFS('07 PDR'!$F$4:$F$5600,'07 PDR'!$A$4:$A$5600,'05 CPD'!$A34,'07 PDR'!$L$4:$L$5600,'05 CPD'!AD$2)=0,\"\",SUMIFS('07 PDR'!$F$4:$F$5600,'07 PDR'!$A$4:$A$5600,'05 CPD'!$A34,'07 PDR'!$L$4:$L$5600,'05 CPD'!AD$2))","v":""},{"$f":"IF(SUMIFS('07 PDR'!$F$4:$F$5600,'07 PDR'!$A$4:$A$5600,'05 CPD'!$A34,'07 PDR'!$L$4:$L$5600,'05 CPD'!AE$2)=0,\"\",SUMIFS('07 PDR'!$F$4:$F$5600,'07 PDR'!$A$4:$A$5600,'05 CPD'!$A34,'07 PDR'!$L$4:$L$5600,'05 CPD'!AE$2))","v":""},{"$f":"IF(SUMIFS('07 PDR'!$F$4:$F$5600,'07 PDR'!$A$4:$A$5600,'05 CPD'!$A34,'07 PDR'!$L$4:$L$5600,'05 CPD'!AF$2)=0,\"\",SUMIFS('07 PDR'!$F$4:$F$5600,'07 PDR'!$A$4:$A$5600,'05 CPD'!$A34,'07 PDR'!$L$4:$L$5600,'05 CPD'!AF$2))","v":""}]
["<Insert Period Range for Period 33>","","","",null,null,null,{"$f":"IF(SUMIFS('07 PDR'!$F$4:$F$5600,'07 PDR'!$A$4:$A$5600,'05 CPD'!$A35,'07 PDR'!$K$4:$K$5600,'05 CPD'!H$2)=0,\"\",SUMIFS('07 PDR'!$F$4:$F$5600,'07 PDR'!$A$4:$A$5600,'05 CPD'!$A35,'07 PDR'!$K$4:$K$5600,'05 CPD'!H$2))","v":""},{"$f":"IF(SUMIFS('07 PDR'!$F$4:$F$5600,'07 PDR'!$A$4:$A$5600,'05 CPD'!$A35,'07 PDR'!$K$4:$K$5600,'05 CPD'!I$2)=0,\"\",SUMIFS('07 PDR'!$F$4:$F$5600,'07 PDR'!$A$4:$A$5600,'05 CPD'!$A35,'07 PDR'!$K$4:$K$5600,'05 CPD'!I$2))","v":""},{"$f":"IF(SUMIFS('07 PDR'!$F$4:$F$5600,'07 PDR'!$A$4:$A$5600,'05 CPD'!$A35,'07 PDR'!$K$4:$K$5600,'05 CPD'!J$2)=0,\"\",SUMIFS('07 PDR'!$F$4:$F$5600,'07 PDR'!$A$4:$A$5600,'05 CPD'!$A35,'07 PDR'!$K$4:$K$5600,'05 CPD'!J$2))","v":""},{"$f":"IF(SUMIFS('07 PDR'!$F$4:$F$5600,'07 PDR'!$A$4:$A$5600,'05 CPD'!$A35,'07 PDR'!$K$4:$K$5600,'05 CPD'!K$2)=0,\"\",SUMIFS('07 PDR'!$F$4:$F$5600,'07 PDR'!$A$4:$A$5600,'05 CPD'!$A35,'07 PDR'!$K$4:$K$5600,'05 CPD'!K$2))","v":""},{"$f":"IF(SUMIFS('07 PDR'!$F$4:$F$5600,'07 PDR'!$A$4:$A$5600,'05 CPD'!$A35,'07 PDR'!$K$4:$K$5600,'05 CPD'!L$2)=0,\"\",SUMIFS('07 PDR'!$F$4:$F$5600,'07 PDR'!$A$4:$A$5600,'05 CPD'!$A35,'07 PDR'!$K$4:$K$5600,'05 CPD'!L$2))","v":""},{"$f":"IF(SUMIFS('07 PDR'!$F$4:$F$5600,'07 PDR'!$A$4:$A$5600,'05 CPD'!$A35,'07 PDR'!$K$4:$K$5600,'05 CPD'!M$2)=0,\"\",SUMIFS('07 PDR'!$F$4:$F$5600,'07 PDR'!$A$4:$A$5600,'05 CPD'!$A35,'07 PDR'!$K$4:$K$5600,'05 CPD'!M$2))","v":""},{"$f":"IF(SUMIFS('07 PDR'!$F$4:$F$5600,'07 PDR'!$A$4:$A$5600,'05 CPD'!$A35,'07 PDR'!$K$4:$K$5600,'05 CPD'!N$2)=0,\"\",SUMIFS('07 PDR'!$F$4:$F$5600,'07 PDR'!$A$4:$A$5600,'05 CPD'!$A35,'07 PDR'!$K$4:$K$5600,'05 CPD'!N$2))","v":""},{"$f":"IF(SUMIFS('07 PDR'!$F$4:$F$5600,'07 PDR'!$A$4:$A$5600,'05 CPD'!$A35,'07 PDR'!$K$4:$K$5600,'05 CPD'!O$2)=0,\"\",SUMIFS('07 PDR'!$F$4:$F$5600,'07 PDR'!$A$4:$A$5600,'05 CPD'!$A35,'07 PDR'!$K$4:$K$5600,'05 CPD'!O$2))","v":""},{"$f":"IF(SUMIFS('07 PDR'!$F$4:$F$5600,'07 PDR'!$A$4:$A$5600,'05 CPD'!$A35,'07 PDR'!$K$4:$K$5600,'05 CPD'!P$2)=0,\"\",SUMIFS('07 PDR'!$F$4:$F$5600,'07 PDR'!$A$4:$A$5600,'05 CPD'!$A35,'07 PDR'!$K$4:$K$5600,'05 CPD'!P$2))","v":""},{"$f":"IF(SUMIFS('07 PDR'!$F$4:$F$5600,'07 PDR'!$A$4:$A$5600,'05 CPD'!$A35,'07 PDR'!$K$4:$K$5600,'05 CPD'!Q$2)=0,\"\",SUMIFS('07 PDR'!$F$4:$F$5600,'07 PDR'!$A$4:$A$5600,'05 CPD'!$A35,'07 PDR'!$K$4:$K$5600,'05 CPD'!Q$2))","v":""},{"$f":"IF(SUMIFS('07 PDR'!$F$4:$F$5600,'07 PDR'!$A$4:$A$5600,'05 CPD'!$A35,'07 PDR'!$K$4:$K$5600,'05 CPD'!R$2)=0,\"\",SUMIFS('07 PDR'!$F$4:$F$5600,'07 PDR'!$A$4:$A$5600,'05 CPD'!$A35,'07 PDR'!$K$4:$K$5600,'05 CPD'!R$2))","v":""},null,{"$f":"IF(SUMIFS('07 PDR'!$F$4:$F$5600,'07 PDR'!$A$4:$A$5600,'05 CPD'!$A35,'07 PDR'!$L$4:$L$5600,'05 CPD'!T$2)=0,\"\",SUMIFS('07 PDR'!$F$4:$F$5600,'07 PDR'!$A$4:$A$5600,'05 CPD'!$A35,'07 PDR'!$L$4:$L$5600,'05 CPD'!T$2))","v":""},{"$f":"IF(SUMIFS('07 PDR'!$F$4:$F$5600,'07 PDR'!$A$4:$A$5600,'05 CPD'!$A35,'07 PDR'!$L$4:$L$5600,'05 CPD'!U$2)=0,\"\",SUMIFS('07 PDR'!$F$4:$F$5600,'07 PDR'!$A$4:$A$5600,'05 CPD'!$A35,'07 PDR'!$L$4:$L$5600,'05 CPD'!U$2))","v":""},{"$f":"IF(SUMIFS('07 PDR'!$F$4:$F$5600,'07 PDR'!$A$4:$A$5600,'05 CPD'!$A35,'07 PDR'!$L$4:$L$5600,'05 CPD'!V$2)=0,\"\",SUMIFS('07 PDR'!$F$4:$F$5600,'07 PDR'!$A$4:$A$5600,'05 CPD'!$A35,'07 PDR'!$L$4:$L$5600,'05 CPD'!V$2))","v":""},{"$f":"IF(SUMIFS('07 PDR'!$F$4:$F$5600,'07 PDR'!$A$4:$A$5600,'05 CPD'!$A35,'07 PDR'!$L$4:$L$5600,'05 CPD'!W$2)=0,\"\",SUMIFS('07 PDR'!$F$4:$F$5600,'07 PDR'!$A$4:$A$5600,'05 CPD'!$A35,'07 PDR'!$L$4:$L$5600,'05 CPD'!W$2))","v":""},{"$f":"IF(SUMIFS('07 PDR'!$F$4:$F$5600,'07 PDR'!$A$4:$A$5600,'05 CPD'!$A35,'07 PDR'!$L$4:$L$5600,'05 CPD'!X$2)=0,\"\",SUMIFS('07 PDR'!$F$4:$F$5600,'07 PDR'!$A$4:$A$5600,'05 CPD'!$A35,'07 PDR'!$L$4:$L$5600,'05 CPD'!X$2))","v":""},{"$f":"IF(SUMIFS('07 PDR'!$F$4:$F$5600,'07 PDR'!$A$4:$A$5600,'05 CPD'!$A35,'07 PDR'!$L$4:$L$5600,'05 CPD'!Y$2)=0,\"\",SUMIFS('07 PDR'!$F$4:$F$5600,'07 PDR'!$A$4:$A$5600,'05 CPD'!$A35,'07 PDR'!$L$4:$L$5600,'05 CPD'!Y$2))","v":""},{"$f":"IF(SUMIFS('07 PDR'!$F$4:$F$5600,'07 PDR'!$A$4:$A$5600,'05 CPD'!$A35,'07 PDR'!$L$4:$L$5600,'05 CPD'!Z$2)=0,\"\",SUMIFS('07 PDR'!$F$4:$F$5600,'07 PDR'!$A$4:$A$5600,'05 CPD'!$A35,'07 PDR'!$L$4:$L$5600,'05 CPD'!Z$2))","v":""},{"$f":"IF(SUMIFS('07 PDR'!$F$4:$F$5600,'07 PDR'!$A$4:$A$5600,'05 CPD'!$A35,'07 PDR'!$L$4:$L$5600,'05 CPD'!AA$2)=0,\"\",SUMIFS('07 PDR'!$F$4:$F$5600,'07 PDR'!$A$4:$A$5600,'05 CPD'!$A35,'07 PDR'!$L$4:$L$5600,'05 CPD'!AA$2))","v":""},{"$f":"IF(SUMIFS('07 PDR'!$F$4:$F$5600,'07 PDR'!$A$4:$A$5600,'05 CPD'!$A35,'07 PDR'!$L$4:$L$5600,'05 CPD'!AB$2)=0,\"\",SUMIFS('07 PDR'!$F$4:$F$5600,'07 PDR'!$A$4:$A$5600,'05 CPD'!$A35,'07 PDR'!$L$4:$L$5600,'05 CPD'!AB$2))","v":""},{"$f":"IF(SUMIFS('07 PDR'!$F$4:$F$5600,'07 PDR'!$A$4:$A$5600,'05 CPD'!$A35,'07 PDR'!$L$4:$L$5600,'05 CPD'!AC$2)=0,\"\",SUMIFS('07 PDR'!$F$4:$F$5600,'07 PDR'!$A$4:$A$5600,'05 CPD'!$A35,'07 PDR'!$L$4:$L$5600,'05 CPD'!AC$2))","v":""},{"$f":"IF(SUMIFS('07 PDR'!$F$4:$F$5600,'07 PDR'!$A$4:$A$5600,'05 CPD'!$A35,'07 PDR'!$L$4:$L$5600,'05 CPD'!AD$2)=0,\"\",SUMIFS('07 PDR'!$F$4:$F$5600,'07 PDR'!$A$4:$A$5600,'05 CPD'!$A35,'07 PDR'!$L$4:$L$5600,'05 CPD'!AD$2))","v":""},{"$f":"IF(SUMIFS('07 PDR'!$F$4:$F$5600,'07 PDR'!$A$4:$A$5600,'05 CPD'!$A35,'07 PDR'!$L$4:$L$5600,'05 CPD'!AE$2)=0,\"\",SUMIFS('07 PDR'!$F$4:$F$5600,'07 PDR'!$A$4:$A$5600,'05 CPD'!$A35,'07 PDR'!$L$4:$L$5600,'05 CPD'!AE$2))","v":""},{"$f":"IF(SUMIFS('07 PDR'!$F$4:$F$5600,'07 PDR'!$A$4:$A$5600,'05 CPD'!$A35,'07 PDR'!$L$4:$L$5600,'05 CPD'!AF$2)=0,\"\",SUMIFS('07 PDR'!$F$4:$F$5600,'07 PDR'!$A$4:$A$5600,'05 CPD'!$A35,'07 PDR'!$L$4:$L$5600,'05 CPD'!AF$2))","v":""}]
["<Insert Period Range for Period 34>","","","",null,null,null,{"$f":"IF(SUMIFS('07 PDR'!$F$4:$F$5600,'07 PDR'!$A$4:$A$5600,'05 CPD'!$A36,'07 PDR'!$K$4:$K$5600,'05 CPD'!H$2)=0,\"\",SUMIFS('07 PDR'!$F$4:$F$5600,'07 PDR'!$A$4:$A$5600,'05 CPD'!$A36,'07 PDR'!$K$4:$K$5600,'05 CPD'!H$2))","v":""},{"$f":"IF(SUMIFS('07 PDR'!$F$4:$F$5600,'07 PDR'!$A$4:$A$5600,'05 CPD'!$A36,'07 PDR'!$K$4:$K$5600,'05 CPD'!I$2)=0,\"\",SUMIFS('07 PDR'!$F$4:$F$5600,'07 PDR'!$A$4:$A$5600,'05 CPD'!$A36,'07 PDR'!$K$4:$K$5600,'05 CPD'!I$2))","v":""},{"$f":"IF(SUMIFS('07 PDR'!$F$4:$F$5600,'07 PDR'!$A$4:$A$5600,'05 CPD'!$A36,'07 PDR'!$K$4:$K$5600,'05 CPD'!J$2)=0,\"\",SUMIFS('07 PDR'!$F$4:$F$5600,'07 PDR'!$A$4:$A$5600,'05 CPD'!$A36,'07 PDR'!$K$4:$K$5600,'05 CPD'!J$2))","v":""},{"$f":"IF(SUMIFS('07 PDR'!$F$4:$F$5600,'07 PDR'!$A$4:$A$5600,'05 CPD'!$A36,'07 PDR'!$K$4:$K$5600,'05 CPD'!K$2)=0,\"\",SUMIFS('07 PDR'!$F$4:$F$5600,'07 PDR'!$A$4:$A$5600,'05 CPD'!$A36,'07 PDR'!$K$4:$K$5600,'05 CPD'!K$2))","v":""},{"$f":"IF(SUMIFS('07 PDR'!$F$4:$F$5600,'07 PDR'!$A$4:$A$5600,'05 CPD'!$A36,'07 PDR'!$K$4:$K$5600,'05 CPD'!L$2)=0,\"\",SUMIFS('07 PDR'!$F$4:$F$5600,'07 PDR'!$A$4:$A$5600,'05 CPD'!$A36,'07 PDR'!$K$4:$K$5600,'05 CPD'!L$2))","v":""},{"$f":"IF(SUMIFS('07 PDR'!$F$4:$F$5600,'07 PDR'!$A$4:$A$5600,'05 CPD'!$A36,'07 PDR'!$K$4:$K$5600,'05 CPD'!M$2)=0,\"\",SUMIFS('07 PDR'!$F$4:$F$5600,'07 PDR'!$A$4:$A$5600,'05 CPD'!$A36,'07 PDR'!$K$4:$K$5600,'05 CPD'!M$2))","v":""},{"$f":"IF(SUMIFS('07 PDR'!$F$4:$F$5600,'07 PDR'!$A$4:$A$5600,'05 CPD'!$A36,'07 PDR'!$K$4:$K$5600,'05 CPD'!N$2)=0,\"\",SUMIFS('07 PDR'!$F$4:$F$5600,'07 PDR'!$A$4:$A$5600,'05 CPD'!$A36,'07 PDR'!$K$4:$K$5600,'05 CPD'!N$2))","v":""},{"$f":"IF(SUMIFS('07 PDR'!$F$4:$F$5600,'07 PDR'!$A$4:$A$5600,'05 CPD'!$A36,'07 PDR'!$K$4:$K$5600,'05 CPD'!O$2)=0,\"\",SUMIFS('07 PDR'!$F$4:$F$5600,'07 PDR'!$A$4:$A$5600,'05 CPD'!$A36,'07 PDR'!$K$4:$K$5600,'05 CPD'!O$2))","v":""},{"$f":"IF(SUMIFS('07 PDR'!$F$4:$F$5600,'07 PDR'!$A$4:$A$5600,'05 CPD'!$A36,'07 PDR'!$K$4:$K$5600,'05 CPD'!P$2)=0,\"\",SUMIFS('07 PDR'!$F$4:$F$5600,'07 PDR'!$A$4:$A$5600,'05 CPD'!$A36,'07 PDR'!$K$4:$K$5600,'05 CPD'!P$2))","v":""},{"$f":"IF(SUMIFS('07 PDR'!$F$4:$F$5600,'07 PDR'!$A$4:$A$5600,'05 CPD'!$A36,'07 PDR'!$K$4:$K$5600,'05 CPD'!Q$2)=0,\"\",SUMIFS('07 PDR'!$F$4:$F$5600,'07 PDR'!$A$4:$A$5600,'05 CPD'!$A36,'07 PDR'!$K$4:$K$5600,'05 CPD'!Q$2))","v":""},{"$f":"IF(SUMIFS('07 PDR'!$F$4:$F$5600,'07 PDR'!$A$4:$A$5600,'05 CPD'!$A36,'07 PDR'!$K$4:$K$5600,'05 CPD'!R$2)=0,\"\",SUMIFS('07 PDR'!$F$4:$F$5600,'07 PDR'!$A$4:$A$5600,'05 CPD'!$A36,'07 PDR'!$K$4:$K$5600,'05 CPD'!R$2))","v":""},null,{"$f":"IF(SUMIFS('07 PDR'!$F$4:$F$5600,'07 PDR'!$A$4:$A$5600,'05 CPD'!$A36,'07 PDR'!$L$4:$L$5600,'05 CPD'!T$2)=0,\"\",SUMIFS('07 PDR'!$F$4:$F$5600,'07 PDR'!$A$4:$A$5600,'05 CPD'!$A36,'07 PDR'!$L$4:$L$5600,'05 CPD'!T$2))","v":""},{"$f":"IF(SUMIFS('07 PDR'!$F$4:$F$5600,'07 PDR'!$A$4:$A$5600,'05 CPD'!$A36,'07 PDR'!$L$4:$L$5600,'05 CPD'!U$2)=0,\"\",SUMIFS('07 PDR'!$F$4:$F$5600,'07 PDR'!$A$4:$A$5600,'05 CPD'!$A36,'07 PDR'!$L$4:$L$5600,'05 CPD'!U$2))","v":""},{"$f":"IF(SUMIFS('07 PDR'!$F$4:$F$5600,'07 PDR'!$A$4:$A$5600,'05 CPD'!$A36,'07 PDR'!$L$4:$L$5600,'05 CPD'!V$2)=0,\"\",SUMIFS('07 PDR'!$F$4:$F$5600,'07 PDR'!$A$4:$A$5600,'05 CPD'!$A36,'07 PDR'!$L$4:$L$5600,'05 CPD'!V$2))","v":""},{"$f":"IF(SUMIFS('07 PDR'!$F$4:$F$5600,'07 PDR'!$A$4:$A$5600,'05 CPD'!$A36,'07 PDR'!$L$4:$L$5600,'05 CPD'!W$2)=0,\"\",SUMIFS('07 PDR'!$F$4:$F$5600,'07 PDR'!$A$4:$A$5600,'05 CPD'!$A36,'07 PDR'!$L$4:$L$5600,'05 CPD'!W$2))","v":""},{"$f":"IF(SUMIFS('07 PDR'!$F$4:$F$5600,'07 PDR'!$A$4:$A$5600,'05 CPD'!$A36,'07 PDR'!$L$4:$L$5600,'05 CPD'!X$2)=0,\"\",SUMIFS('07 PDR'!$F$4:$F$5600,'07 PDR'!$A$4:$A$5600,'05 CPD'!$A36,'07 PDR'!$L$4:$L$5600,'05 CPD'!X$2))","v":""},{"$f":"IF(SUMIFS('07 PDR'!$F$4:$F$5600,'07 PDR'!$A$4:$A$5600,'05 CPD'!$A36,'07 PDR'!$L$4:$L$5600,'05 CPD'!Y$2)=0,\"\",SUMIFS('07 PDR'!$F$4:$F$5600,'07 PDR'!$A$4:$A$5600,'05 CPD'!$A36,'07 PDR'!$L$4:$L$5600,'05 CPD'!Y$2))","v":""},{"$f":"IF(SUMIFS('07 PDR'!$F$4:$F$5600,'07 PDR'!$A$4:$A$5600,'05 CPD'!$A36,'07 PDR'!$L$4:$L$5600,'05 CPD'!Z$2)=0,\"\",SUMIFS('07 PDR'!$F$4:$F$5600,'07 PDR'!$A$4:$A$5600,'05 CPD'!$A36,'07 PDR'!$L$4:$L$5600,'05 CPD'!Z$2))","v":""},{"$f":"IF(SUMIFS('07 PDR'!$F$4:$F$5600,'07 PDR'!$A$4:$A$5600,'05 CPD'!$A36,'07 PDR'!$L$4:$L$5600,'05 CPD'!AA$2)=0,\"\",SUMIFS('07 PDR'!$F$4:$F$5600,'07 PDR'!$A$4:$A$5600,'05 CPD'!$A36,'07 PDR'!$L$4:$L$5600,'05 CPD'!AA$2))","v":""},{"$f":"IF(SUMIFS('07 PDR'!$F$4:$F$5600,'07 PDR'!$A$4:$A$5600,'05 CPD'!$A36,'07 PDR'!$L$4:$L$5600,'05 CPD'!AB$2)=0,\"\",SUMIFS('07 PDR'!$F$4:$F$5600,'07 PDR'!$A$4:$A$5600,'05 CPD'!$A36,'07 PDR'!$L$4:$L$5600,'05 CPD'!AB$2))","v":""},{"$f":"IF(SUMIFS('07 PDR'!$F$4:$F$5600,'07 PDR'!$A$4:$A$5600,'05 CPD'!$A36,'07 PDR'!$L$4:$L$5600,'05 CPD'!AC$2)=0,\"\",SUMIFS('07 PDR'!$F$4:$F$5600,'07 PDR'!$A$4:$A$5600,'05 CPD'!$A36,'07 PDR'!$L$4:$L$5600,'05 CPD'!AC$2))","v":""},{"$f":"IF(SUMIFS('07 PDR'!$F$4:$F$5600,'07 PDR'!$A$4:$A$5600,'05 CPD'!$A36,'07 PDR'!$L$4:$L$5600,'05 CPD'!AD$2)=0,\"\",SUMIFS('07 PDR'!$F$4:$F$5600,'07 PDR'!$A$4:$A$5600,'05 CPD'!$A36,'07 PDR'!$L$4:$L$5600,'05 CPD'!AD$2))","v":""},{"$f":"IF(SUMIFS('07 PDR'!$F$4:$F$5600,'07 PDR'!$A$4:$A$5600,'05 CPD'!$A36,'07 PDR'!$L$4:$L$5600,'05 CPD'!AE$2)=0,\"\",SUMIFS('07 PDR'!$F$4:$F$5600,'07 PDR'!$A$4:$A$5600,'05 CPD'!$A36,'07 PDR'!$L$4:$L$5600,'05 CPD'!AE$2))","v":""},{"$f":"IF(SUMIFS('07 PDR'!$F$4:$F$5600,'07 PDR'!$A$4:$A$5600,'05 CPD'!$A36,'07 PDR'!$L$4:$L$5600,'05 CPD'!AF$2)=0,\"\",SUMIFS('07 PDR'!$F$4:$F$5600,'07 PDR'!$A$4:$A$5600,'05 CPD'!$A36,'07 PDR'!$L$4:$L$5600,'05 CPD'!AF$2))","v":""}]
["<Insert Period Range for Period 35>","","","",null,null,null,{"$f":"IF(SUMIFS('07 PDR'!$F$4:$F$5600,'07 PDR'!$A$4:$A$5600,'05 CPD'!$A37,'07 PDR'!$K$4:$K$5600,'05 CPD'!H$2)=0,\"\",SUMIFS('07 PDR'!$F$4:$F$5600,'07 PDR'!$A$4:$A$5600,'05 CPD'!$A37,'07 PDR'!$K$4:$K$5600,'05 CPD'!H$2))","v":""},{"$f":"IF(SUMIFS('07 PDR'!$F$4:$F$5600,'07 PDR'!$A$4:$A$5600,'05 CPD'!$A37,'07 PDR'!$K$4:$K$5600,'05 CPD'!I$2)=0,\"\",SUMIFS('07 PDR'!$F$4:$F$5600,'07 PDR'!$A$4:$A$5600,'05 CPD'!$A37,'07 PDR'!$K$4:$K$5600,'05 CPD'!I$2))","v":""},{"$f":"IF(SUMIFS('07 PDR'!$F$4:$F$5600,'07 PDR'!$A$4:$A$5600,'05 CPD'!$A37,'07 PDR'!$K$4:$K$5600,'05 CPD'!J$2)=0,\"\",SUMIFS('07 PDR'!$F$4:$F$5600,'07 PDR'!$A$4:$A$5600,'05 CPD'!$A37,'07 PDR'!$K$4:$K$5600,'05 CPD'!J$2))","v":""},{"$f":"IF(SUMIFS('07 PDR'!$F$4:$F$5600,'07 PDR'!$A$4:$A$5600,'05 CPD'!$A37,'07 PDR'!$K$4:$K$5600,'05 CPD'!K$2)=0,\"\",SUMIFS('07 PDR'!$F$4:$F$5600,'07 PDR'!$A$4:$A$5600,'05 CPD'!$A37,'07 PDR'!$K$4:$K$5600,'05 CPD'!K$2))","v":""},{"$f":"IF(SUMIFS('07 PDR'!$F$4:$F$5600,'07 PDR'!$A$4:$A$5600,'05 CPD'!$A37,'07 PDR'!$K$4:$K$5600,'05 CPD'!L$2)=0,\"\",SUMIFS('07 PDR'!$F$4:$F$5600,'07 PDR'!$A$4:$A$5600,'05 CPD'!$A37,'07 PDR'!$K$4:$K$5600,'05 CPD'!L$2))","v":""},{"$f":"IF(SUMIFS('07 PDR'!$F$4:$F$5600,'07 PDR'!$A$4:$A$5600,'05 CPD'!$A37,'07 PDR'!$K$4:$K$5600,'05 CPD'!M$2)=0,\"\",SUMIFS('07 PDR'!$F$4:$F$5600,'07 PDR'!$A$4:$A$5600,'05 CPD'!$A37,'07 PDR'!$K$4:$K$5600,'05 CPD'!M$2))","v":""},{"$f":"IF(SUMIFS('07 PDR'!$F$4:$F$5600,'07 PDR'!$A$4:$A$5600,'05 CPD'!$A37,'07 PDR'!$K$4:$K$5600,'05 CPD'!N$2)=0,\"\",SUMIFS('07 PDR'!$F$4:$F$5600,'07 PDR'!$A$4:$A$5600,'05 CPD'!$A37,'07 PDR'!$K$4:$K$5600,'05 CPD'!N$2))","v":""},{"$f":"IF(SUMIFS('07 PDR'!$F$4:$F$5600,'07 PDR'!$A$4:$A$5600,'05 CPD'!$A37,'07 PDR'!$K$4:$K$5600,'05 CPD'!O$2)=0,\"\",SUMIFS('07 PDR'!$F$4:$F$5600,'07 PDR'!$A$4:$A$5600,'05 CPD'!$A37,'07 PDR'!$K$4:$K$5600,'05 CPD'!O$2))","v":""},{"$f":"IF(SUMIFS('07 PDR'!$F$4:$F$5600,'07 PDR'!$A$4:$A$5600,'05 CPD'!$A37,'07 PDR'!$K$4:$K$5600,'05 CPD'!P$2)=0,\"\",SUMIFS('07 PDR'!$F$4:$F$5600,'07 PDR'!$A$4:$A$5600,'05 CPD'!$A37,'07 PDR'!$K$4:$K$5600,'05 CPD'!P$2))","v":""},{"$f":"IF(SUMIFS('07 PDR'!$F$4:$F$5600,'07 PDR'!$A$4:$A$5600,'05 CPD'!$A37,'07 PDR'!$K$4:$K$5600,'05 CPD'!Q$2)=0,\"\",SUMIFS('07 PDR'!$F$4:$F$5600,'07 PDR'!$A$4:$A$5600,'05 CPD'!$A37,'07 PDR'!$K$4:$K$5600,'05 CPD'!Q$2))","v":""},{"$f":"IF(SUMIFS('07 PDR'!$F$4:$F$5600,'07 PDR'!$A$4:$A$5600,'05 CPD'!$A37,'07 PDR'!$K$4:$K$5600,'05 CPD'!R$2)=0,\"\",SUMIFS('07 PDR'!$F$4:$F$5600,'07 PDR'!$A$4:$A$5600,'05 CPD'!$A37,'07 PDR'!$K$4:$K$5600,'05 CPD'!R$2))","v":""},null,{"$f":"IF(SUMIFS('07 PDR'!$F$4:$F$5600,'07 PDR'!$A$4:$A$5600,'05 CPD'!$A37,'07 PDR'!$L$4:$L$5600,'05 CPD'!T$2)=0,\"\",SUMIFS('07 PDR'!$F$4:$F$5600,'07 PDR'!$A$4:$A$5600,'05 CPD'!$A37,'07 PDR'!$L$4:$L$5600,'05 CPD'!T$2))","v":""},{"$f":"IF(SUMIFS('07 PDR'!$F$4:$F$5600,'07 PDR'!$A$4:$A$5600,'05 CPD'!$A37,'07 PDR'!$L$4:$L$5600,'05 CPD'!U$2)=0,\"\",SUMIFS('07 PDR'!$F$4:$F$5600,'07 PDR'!$A$4:$A$5600,'05 CPD'!$A37,'07 PDR'!$L$4:$L$5600,'05 CPD'!U$2))","v":""},{"$f":"IF(SUMIFS('07 PDR'!$F$4:$F$5600,'07 PDR'!$A$4:$A$5600,'05 CPD'!$A37,'07 PDR'!$L$4:$L$5600,'05 CPD'!V$2)=0,\"\",SUMIFS('07 PDR'!$F$4:$F$5600,'07 PDR'!$A$4:$A$5600,'05 CPD'!$A37,'07 PDR'!$L$4:$L$5600,'05 CPD'!V$2))","v":""},{"$f":"IF(SUMIFS('07 PDR'!$F$4:$F$5600,'07 PDR'!$A$4:$A$5600,'05 CPD'!$A37,'07 PDR'!$L$4:$L$5600,'05 CPD'!W$2)=0,\"\",SUMIFS('07 PDR'!$F$4:$F$5600,'07 PDR'!$A$4:$A$5600,'05 CPD'!$A37,'07 PDR'!$L$4:$L$5600,'05 CPD'!W$2))","v":""},{"$f":"IF(SUMIFS('07 PDR'!$F$4:$F$5600,'07 PDR'!$A$4:$A$5600,'05 CPD'!$A37,'07 PDR'!$L$4:$L$5600,'05 CPD'!X$2)=0,\"\",SUMIFS('07 PDR'!$F$4:$F$5600,'07 PDR'!$A$4:$A$5600,'05 CPD'!$A37,'07 PDR'!$L$4:$L$5600,'05 CPD'!X$2))","v":""},{"$f":"IF(SUMIFS('07 PDR'!$F$4:$F$5600,'07 PDR'!$A$4:$A$5600,'05 CPD'!$A37,'07 PDR'!$L$4:$L$5600,'05 CPD'!Y$2)=0,\"\",SUMIFS('07 PDR'!$F$4:$F$5600,'07 PDR'!$A$4:$A$5600,'05 CPD'!$A37,'07 PDR'!$L$4:$L$5600,'05 CPD'!Y$2))","v":""},{"$f":"IF(SUMIFS('07 PDR'!$F$4:$F$5600,'07 PDR'!$A$4:$A$5600,'05 CPD'!$A37,'07 PDR'!$L$4:$L$5600,'05 CPD'!Z$2)=0,\"\",SUMIFS('07 PDR'!$F$4:$F$5600,'07 PDR'!$A$4:$A$5600,'05 CPD'!$A37,'07 PDR'!$L$4:$L$5600,'05 CPD'!Z$2))","v":""},{"$f":"IF(SUMIFS('07 PDR'!$F$4:$F$5600,'07 PDR'!$A$4:$A$5600,'05 CPD'!$A37,'07 PDR'!$L$4:$L$5600,'05 CPD'!AA$2)=0,\"\",SUMIFS('07 PDR'!$F$4:$F$5600,'07 PDR'!$A$4:$A$5600,'05 CPD'!$A37,'07 PDR'!$L$4:$L$5600,'05 CPD'!AA$2))","v":""},{"$f":"IF(SUMIFS('07 PDR'!$F$4:$F$5600,'07 PDR'!$A$4:$A$5600,'05 CPD'!$A37,'07 PDR'!$L$4:$L$5600,'05 CPD'!AB$2)=0,\"\",SUMIFS('07 PDR'!$F$4:$F$5600,'07 PDR'!$A$4:$A$5600,'05 CPD'!$A37,'07 PDR'!$L$4:$L$5600,'05 CPD'!AB$2))","v":""},{"$f":"IF(SUMIFS('07 PDR'!$F$4:$F$5600,'07 PDR'!$A$4:$A$5600,'05 CPD'!$A37,'07 PDR'!$L$4:$L$5600,'05 CPD'!AC$2)=0,\"\",SUMIFS('07 PDR'!$F$4:$F$5600,'07 PDR'!$A$4:$A$5600,'05 CPD'!$A37,'07 PDR'!$L$4:$L$5600,'05 CPD'!AC$2))","v":""},{"$f":"IF(SUMIFS('07 PDR'!$F$4:$F$5600,'07 PDR'!$A$4:$A$5600,'05 CPD'!$A37,'07 PDR'!$L$4:$L$5600,'05 CPD'!AD$2)=0,\"\",SUMIFS('07 PDR'!$F$4:$F$5600,'07 PDR'!$A$4:$A$5600,'05 CPD'!$A37,'07 PDR'!$L$4:$L$5600,'05 CPD'!AD$2))","v":""},{"$f":"IF(SUMIFS('07 PDR'!$F$4:$F$5600,'07 PDR'!$A$4:$A$5600,'05 CPD'!$A37,'07 PDR'!$L$4:$L$5600,'05 CPD'!AE$2)=0,\"\",SUMIFS('07 PDR'!$F$4:$F$5600,'07 PDR'!$A$4:$A$5600,'05 CPD'!$A37,'07 PDR'!$L$4:$L$5600,'05 CPD'!AE$2))","v":""},{"$f":"IF(SUMIFS('07 PDR'!$F$4:$F$5600,'07 PDR'!$A$4:$A$5600,'05 CPD'!$A37,'07 PDR'!$L$4:$L$5600,'05 CPD'!AF$2)=0,\"\",SUMIFS('07 PDR'!$F$4:$F$5600,'07 PDR'!$A$4:$A$5600,'05 CPD'!$A37,'07 PDR'!$L$4:$L$5600,'05 CPD'!AF$2))","v":""}]
["<Insert Period Range for Period 36>","","","",null,null,null,{"$f":"IF(SUMIFS('07 PDR'!$F$4:$F$5600,'07 PDR'!$A$4:$A$5600,'05 CPD'!$A38,'07 PDR'!$K$4:$K$5600,'05 CPD'!H$2)=0,\"\",SUMIFS('07 PDR'!$F$4:$F$5600,'07 PDR'!$A$4:$A$5600,'05 CPD'!$A38,'07 PDR'!$K$4:$K$5600,'05 CPD'!H$2))","v":""},{"$f":"IF(SUMIFS('07 PDR'!$F$4:$F$5600,'07 PDR'!$A$4:$A$5600,'05 CPD'!$A38,'07 PDR'!$K$4:$K$5600,'05 CPD'!I$2)=0,\"\",SUMIFS('07 PDR'!$F$4:$F$5600,'07 PDR'!$A$4:$A$5600,'05 CPD'!$A38,'07 PDR'!$K$4:$K$5600,'05 CPD'!I$2))","v":""},{"$f":"IF(SUMIFS('07 PDR'!$F$4:$F$5600,'07 PDR'!$A$4:$A$5600,'05 CPD'!$A38,'07 PDR'!$K$4:$K$5600,'05 CPD'!J$2)=0,\"\",SUMIFS('07 PDR'!$F$4:$F$5600,'07 PDR'!$A$4:$A$5600,'05 CPD'!$A38,'07 PDR'!$K$4:$K$5600,'05 CPD'!J$2))","v":""},{"$f":"IF(SUMIFS('07 PDR'!$F$4:$F$5600,'07 PDR'!$A$4:$A$5600,'05 CPD'!$A38,'07 PDR'!$K$4:$K$5600,'05 CPD'!K$2)=0,\"\",SUMIFS('07 PDR'!$F$4:$F$5600,'07 PDR'!$A$4:$A$5600,'05 CPD'!$A38,'07 PDR'!$K$4:$K$5600,'05 CPD'!K$2))","v":""},{"$f":"IF(SUMIFS('07 PDR'!$F$4:$F$5600,'07 PDR'!$A$4:$A$5600,'05 CPD'!$A38,'07 PDR'!$K$4:$K$5600,'05 CPD'!L$2)=0,\"\",SUMIFS('07 PDR'!$F$4:$F$5600,'07 PDR'!$A$4:$A$5600,'05 CPD'!$A38,'07 PDR'!$K$4:$K$5600,'05 CPD'!L$2))","v":""},{"$f":"IF(SUMIFS('07 PDR'!$F$4:$F$5600,'07 PDR'!$A$4:$A$5600,'05 CPD'!$A38,'07 PDR'!$K$4:$K$5600,'05 CPD'!M$2)=0,\"\",SUMIFS('07 PDR'!$F$4:$F$5600,'07 PDR'!$A$4:$A$5600,'05 CPD'!$A38,'07 PDR'!$K$4:$K$5600,'05 CPD'!M$2))","v":""},{"$f":"IF(SUMIFS('07 PDR'!$F$4:$F$5600,'07 PDR'!$A$4:$A$5600,'05 CPD'!$A38,'07 PDR'!$K$4:$K$5600,'05 CPD'!N$2)=0,\"\",SUMIFS('07 PDR'!$F$4:$F$5600,'07 PDR'!$A$4:$A$5600,'05 CPD'!$A38,'07 PDR'!$K$4:$K$5600,'05 CPD'!N$2))","v":""},{"$f":"IF(SUMIFS('07 PDR'!$F$4:$F$5600,'07 PDR'!$A$4:$A$5600,'05 CPD'!$A38,'07 PDR'!$K$4:$K$5600,'05 CPD'!O$2)=0,\"\",SUMIFS('07 PDR'!$F$4:$F$5600,'07 PDR'!$A$4:$A$5600,'05 CPD'!$A38,'07 PDR'!$K$4:$K$5600,'05 CPD'!O$2))","v":""},{"$f":"IF(SUMIFS('07 PDR'!$F$4:$F$5600,'07 PDR'!$A$4:$A$5600,'05 CPD'!$A38,'07 PDR'!$K$4:$K$5600,'05 CPD'!P$2)=0,\"\",SUMIFS('07 PDR'!$F$4:$F$5600,'07 PDR'!$A$4:$A$5600,'05 CPD'!$A38,'07 PDR'!$K$4:$K$5600,'05 CPD'!P$2))","v":""},{"$f":"IF(SUMIFS('07 PDR'!$F$4:$F$5600,'07 PDR'!$A$4:$A$5600,'05 CPD'!$A38,'07 PDR'!$K$4:$K$5600,'05 CPD'!Q$2)=0,\"\",SUMIFS('07 PDR'!$F$4:$F$5600,'07 PDR'!$A$4:$A$5600,'05 CPD'!$A38,'07 PDR'!$K$4:$K$5600,'05 CPD'!Q$2))","v":""},{"$f":"IF(SUMIFS('07 PDR'!$F$4:$F$5600,'07 PDR'!$A$4:$A$5600,'05 CPD'!$A38,'07 PDR'!$K$4:$K$5600,'05 CPD'!R$2)=0,\"\",SUMIFS('07 PDR'!$F$4:$F$5600,'07 PDR'!$A$4:$A$5600,'05 CPD'!$A38,'07 PDR'!$K$4:$K$5600,'05 CPD'!R$2))","v":""},null,{"$f":"IF(SUMIFS('07 PDR'!$F$4:$F$5600,'07 PDR'!$A$4:$A$5600,'05 CPD'!$A38,'07 PDR'!$L$4:$L$5600,'05 CPD'!T$2)=0,\"\",SUMIFS('07 PDR'!$F$4:$F$5600,'07 PDR'!$A$4:$A$5600,'05 CPD'!$A38,'07 PDR'!$L$4:$L$5600,'05 CPD'!T$2))","v":""},{"$f":"IF(SUMIFS('07 PDR'!$F$4:$F$5600,'07 PDR'!$A$4:$A$5600,'05 CPD'!$A38,'07 PDR'!$L$4:$L$5600,'05 CPD'!U$2)=0,\"\",SUMIFS('07 PDR'!$F$4:$F$5600,'07 PDR'!$A$4:$A$5600,'05 CPD'!$A38,'07 PDR'!$L$4:$L$5600,'05 CPD'!U$2))","v":""},{"$f":"IF(SUMIFS('07 PDR'!$F$4:$F$5600,'07 PDR'!$A$4:$A$5600,'05 CPD'!$A38,'07 PDR'!$L$4:$L$5600,'05 CPD'!V$2)=0,\"\",SUMIFS('07 PDR'!$F$4:$F$5600,'07 PDR'!$A$4:$A$5600,'05 CPD'!$A38,'07 PDR'!$L$4:$L$5600,'05 CPD'!V$2))","v":""},{"$f":"IF(SUMIFS('07 PDR'!$F$4:$F$5600,'07 PDR'!$A$4:$A$5600,'05 CPD'!$A38,'07 PDR'!$L$4:$L$5600,'05 CPD'!W$2)=0,\"\",SUMIFS('07 PDR'!$F$4:$F$5600,'07 PDR'!$A$4:$A$5600,'05 CPD'!$A38,'07 PDR'!$L$4:$L$5600,'05 CPD'!W$2))","v":""},{"$f":"IF(SUMIFS('07 PDR'!$F$4:$F$5600,'07 PDR'!$A$4:$A$5600,'05 CPD'!$A38,'07 PDR'!$L$4:$L$5600,'05 CPD'!X$2)=0,\"\",SUMIFS('07 PDR'!$F$4:$F$5600,'07 PDR'!$A$4:$A$5600,'05 CPD'!$A38,'07 PDR'!$L$4:$L$5600,'05 CPD'!X$2))","v":""},{"$f":"IF(SUMIFS('07 PDR'!$F$4:$F$5600,'07 PDR'!$A$4:$A$5600,'05 CPD'!$A38,'07 PDR'!$L$4:$L$5600,'05 CPD'!Y$2)=0,\"\",SUMIFS('07 PDR'!$F$4:$F$5600,'07 PDR'!$A$4:$A$5600,'05 CPD'!$A38,'07 PDR'!$L$4:$L$5600,'05 CPD'!Y$2))","v":""},{"$f":"IF(SUMIFS('07 PDR'!$F$4:$F$5600,'07 PDR'!$A$4:$A$5600,'05 CPD'!$A38,'07 PDR'!$L$4:$L$5600,'05 CPD'!Z$2)=0,\"\",SUMIFS('07 PDR'!$F$4:$F$5600,'07 PDR'!$A$4:$A$5600,'05 CPD'!$A38,'07 PDR'!$L$4:$L$5600,'05 CPD'!Z$2))","v":""},{"$f":"IF(SUMIFS('07 PDR'!$F$4:$F$5600,'07 PDR'!$A$4:$A$5600,'05 CPD'!$A38,'07 PDR'!$L$4:$L$5600,'05 CPD'!AA$2)=0,\"\",SUMIFS('07 PDR'!$F$4:$F$5600,'07 PDR'!$A$4:$A$5600,'05 CPD'!$A38,'07 PDR'!$L$4:$L$5600,'05 CPD'!AA$2))","v":""},{"$f":"IF(SUMIFS('07 PDR'!$F$4:$F$5600,'07 PDR'!$A$4:$A$5600,'05 CPD'!$A38,'07 PDR'!$L$4:$L$5600,'05 CPD'!AB$2)=0,\"\",SUMIFS('07 PDR'!$F$4:$F$5600,'07 PDR'!$A$4:$A$5600,'05 CPD'!$A38,'07 PDR'!$L$4:$L$5600,'05 CPD'!AB$2))","v":""},{"$f":"IF(SUMIFS('07 PDR'!$F$4:$F$5600,'07 PDR'!$A$4:$A$5600,'05 CPD'!$A38,'07 PDR'!$L$4:$L$5600,'05 CPD'!AC$2)=0,\"\",SUMIFS('07 PDR'!$F$4:$F$5600,'07 PDR'!$A$4:$A$5600,'05 CPD'!$A38,'07 PDR'!$L$4:$L$5600,'05 CPD'!AC$2))","v":""},{"$f":"IF(SUMIFS('07 PDR'!$F$4:$F$5600,'07 PDR'!$A$4:$A$5600,'05 CPD'!$A38,'07 PDR'!$L$4:$L$5600,'05 CPD'!AD$2)=0,\"\",SUMIFS('07 PDR'!$F$4:$F$5600,'07 PDR'!$A$4:$A$5600,'05 CPD'!$A38,'07 PDR'!$L$4:$L$5600,'05 CPD'!AD$2))","v":""},{"$f":"IF(SUMIFS('07 PDR'!$F$4:$F$5600,'07 PDR'!$A$4:$A$5600,'05 CPD'!$A38,'07 PDR'!$L$4:$L$5600,'05 CPD'!AE$2)=0,\"\",SUMIFS('07 PDR'!$F$4:$F$5600,'07 PDR'!$A$4:$A$5600,'05 CPD'!$A38,'07 PDR'!$L$4:$L$5600,'05 CPD'!AE$2))","v":""},{"$f":"IF(SUMIFS('07 PDR'!$F$4:$F$5600,'07 PDR'!$A$4:$A$5600,'05 CPD'!$A38,'07 PDR'!$L$4:$L$5600,'05 CPD'!AF$2)=0,\"\",SUMIFS('07 PDR'!$F$4:$F$5600,'07 PDR'!$A$4:$A$5600,'05 CPD'!$A38,'07 PDR'!$L$4:$L$5600,'05 CPD'!AF$2))","v":""}]
["<Insert Period Range for Period 37>","","","",null,null,null,{"$f":"IF(SUMIFS('07 PDR'!$F$4:$F$5600,'07 PDR'!$A$4:$A$5600,'05 CPD'!$A39,'07 PDR'!$K$4:$K$5600,'05 CPD'!H$2)=0,\"\",SUMIFS('07 PDR'!$F$4:$F$5600,'07 PDR'!$A$4:$A$5600,'05 CPD'!$A39,'07 PDR'!$K$4:$K$5600,'05 CPD'!H$2))","v":""},{"$f":"IF(SUMIFS('07 PDR'!$F$4:$F$5600,'07 PDR'!$A$4:$A$5600,'05 CPD'!$A39,'07 PDR'!$K$4:$K$5600,'05 CPD'!I$2)=0,\"\",SUMIFS('07 PDR'!$F$4:$F$5600,'07 PDR'!$A$4:$A$5600,'05 CPD'!$A39,'07 PDR'!$K$4:$K$5600,'05 CPD'!I$2))","v":""},{"$f":"IF(SUMIFS('07 PDR'!$F$4:$F$5600,'07 PDR'!$A$4:$A$5600,'05 CPD'!$A39,'07 PDR'!$K$4:$K$5600,'05 CPD'!J$2)=0,\"\",SUMIFS('07 PDR'!$F$4:$F$5600,'07 PDR'!$A$4:$A$5600,'05 CPD'!$A39,'07 PDR'!$K$4:$K$5600,'05 CPD'!J$2))","v":""},{"$f":"IF(SUMIFS('07 PDR'!$F$4:$F$5600,'07 PDR'!$A$4:$A$5600,'05 CPD'!$A39,'07 PDR'!$K$4:$K$5600,'05 CPD'!K$2)=0,\"\",SUMIFS('07 PDR'!$F$4:$F$5600,'07 PDR'!$A$4:$A$5600,'05 CPD'!$A39,'07 PDR'!$K$4:$K$5600,'05 CPD'!K$2))","v":""},{"$f":"IF(SUMIFS('07 PDR'!$F$4:$F$5600,'07 PDR'!$A$4:$A$5600,'05 CPD'!$A39,'07 PDR'!$K$4:$K$5600,'05 CPD'!L$2)=0,\"\",SUMIFS('07 PDR'!$F$4:$F$5600,'07 PDR'!$A$4:$A$5600,'05 CPD'!$A39,'07 PDR'!$K$4:$K$5600,'05 CPD'!L$2))","v":""},{"$f":"IF(SUMIFS('07 PDR'!$F$4:$F$5600,'07 PDR'!$A$4:$A$5600,'05 CPD'!$A39,'07 PDR'!$K$4:$K$5600,'05 CPD'!M$2)=0,\"\",SUMIFS('07 PDR'!$F$4:$F$5600,'07 PDR'!$A$4:$A$5600,'05 CPD'!$A39,'07 PDR'!$K$4:$K$5600,'05 CPD'!M$2))","v":""},{"$f":"IF(SUMIFS('07 PDR'!$F$4:$F$5600,'07 PDR'!$A$4:$A$5600,'05 CPD'!$A39,'07 PDR'!$K$4:$K$5600,'05 CPD'!N$2)=0,\"\",SUMIFS('07 PDR'!$F$4:$F$5600,'07 PDR'!$A$4:$A$5600,'05 CPD'!$A39,'07 PDR'!$K$4:$K$5600,'05 CPD'!N$2))","v":""},{"$f":"IF(SUMIFS('07 PDR'!$F$4:$F$5600,'07 PDR'!$A$4:$A$5600,'05 CPD'!$A39,'07 PDR'!$K$4:$K$5600,'05 CPD'!O$2)=0,\"\",SUMIFS('07 PDR'!$F$4:$F$5600,'07 PDR'!$A$4:$A$5600,'05 CPD'!$A39,'07 PDR'!$K$4:$K$5600,'05 CPD'!O$2))","v":""},{"$f":"IF(SUMIFS('07 PDR'!$F$4:$F$5600,'07 PDR'!$A$4:$A$5600,'05 CPD'!$A39,'07 PDR'!$K$4:$K$5600,'05 CPD'!P$2)=0,\"\",SUMIFS('07 PDR'!$F$4:$F$5600,'07 PDR'!$A$4:$A$5600,'05 CPD'!$A39,'07 PDR'!$K$4:$K$5600,'05 CPD'!P$2))","v":""},{"$f":"IF(SUMIFS('07 PDR'!$F$4:$F$5600,'07 PDR'!$A$4:$A$5600,'05 CPD'!$A39,'07 PDR'!$K$4:$K$5600,'05 CPD'!Q$2)=0,\"\",SUMIFS('07 PDR'!$F$4:$F$5600,'07 PDR'!$A$4:$A$5600,'05 CPD'!$A39,'07 PDR'!$K$4:$K$5600,'05 CPD'!Q$2))","v":""},{"$f":"IF(SUMIFS('07 PDR'!$F$4:$F$5600,'07 PDR'!$A$4:$A$5600,'05 CPD'!$A39,'07 PDR'!$K$4:$K$5600,'05 CPD'!R$2)=0,\"\",SUMIFS('07 PDR'!$F$4:$F$5600,'07 PDR'!$A$4:$A$5600,'05 CPD'!$A39,'07 PDR'!$K$4:$K$5600,'05 CPD'!R$2))","v":""},null,{"$f":"IF(SUMIFS('07 PDR'!$F$4:$F$5600,'07 PDR'!$A$4:$A$5600,'05 CPD'!$A39,'07 PDR'!$L$4:$L$5600,'05 CPD'!T$2)=0,\"\",SUMIFS('07 PDR'!$F$4:$F$5600,'07 PDR'!$A$4:$A$5600,'05 CPD'!$A39,'07 PDR'!$L$4:$L$5600,'05 CPD'!T$2))","v":""},{"$f":"IF(SUMIFS('07 PDR'!$F$4:$F$5600,'07 PDR'!$A$4:$A$5600,'05 CPD'!$A39,'07 PDR'!$L$4:$L$5600,'05 CPD'!U$2)=0,\"\",SUMIFS('07 PDR'!$F$4:$F$5600,'07 PDR'!$A$4:$A$5600,'05 CPD'!$A39,'07 PDR'!$L$4:$L$5600,'05 CPD'!U$2))","v":""},{"$f":"IF(SUMIFS('07 PDR'!$F$4:$F$5600,'07 PDR'!$A$4:$A$5600,'05 CPD'!$A39,'07 PDR'!$L$4:$L$5600,'05 CPD'!V$2)=0,\"\",SUMIFS('07 PDR'!$F$4:$F$5600,'07 PDR'!$A$4:$A$5600,'05 CPD'!$A39,'07 PDR'!$L$4:$L$5600,'05 CPD'!V$2))","v":""},{"$f":"IF(SUMIFS('07 PDR'!$F$4:$F$5600,'07 PDR'!$A$4:$A$5600,'05 CPD'!$A39,'07 PDR'!$L$4:$L$5600,'05 CPD'!W$2)=0,\"\",SUMIFS('07 PDR'!$F$4:$F$5600,'07 PDR'!$A$4:$A$5600,'05 CPD'!$A39,'07 PDR'!$L$4:$L$5600,'05 CPD'!W$2))","v":""},{"$f":"IF(SUMIFS('07 PDR'!$F$4:$F$5600,'07 PDR'!$A$4:$A$5600,'05 CPD'!$A39,'07 PDR'!$L$4:$L$5600,'05 CPD'!X$2)=0,\"\",SUMIFS('07 PDR'!$F$4:$F$5600,'07 PDR'!$A$4:$A$5600,'05 CPD'!$A39,'07 PDR'!$L$4:$L$5600,'05 CPD'!X$2))","v":""},{"$f":"IF(SUMIFS('07 PDR'!$F$4:$F$5600,'07 PDR'!$A$4:$A$5600,'05 CPD'!$A39,'07 PDR'!$L$4:$L$5600,'05 CPD'!Y$2)=0,\"\",SUMIFS('07 PDR'!$F$4:$F$5600,'07 PDR'!$A$4:$A$5600,'05 CPD'!$A39,'07 PDR'!$L$4:$L$5600,'05 CPD'!Y$2))","v":""},{"$f":"IF(SUMIFS('07 PDR'!$F$4:$F$5600,'07 PDR'!$A$4:$A$5600,'05 CPD'!$A39,'07 PDR'!$L$4:$L$5600,'05 CPD'!Z$2)=0,\"\",SUMIFS('07 PDR'!$F$4:$F$5600,'07 PDR'!$A$4:$A$5600,'05 CPD'!$A39,'07 PDR'!$L$4:$L$5600,'05 CPD'!Z$2))","v":""},{"$f":"IF(SUMIFS('07 PDR'!$F$4:$F$5600,'07 PDR'!$A$4:$A$5600,'05 CPD'!$A39,'07 PDR'!$L$4:$L$5600,'05 CPD'!AA$2)=0,\"\",SUMIFS('07 PDR'!$F$4:$F$5600,'07 PDR'!$A$4:$A$5600,'05 CPD'!$A39,'07 PDR'!$L$4:$L$5600,'05 CPD'!AA$2))","v":""},{"$f":"IF(SUMIFS('07 PDR'!$F$4:$F$5600,'07 PDR'!$A$4:$A$5600,'05 CPD'!$A39,'07 PDR'!$L$4:$L$5600,'05 CPD'!AB$2)=0,\"\",SUMIFS('07 PDR'!$F$4:$F$5600,'07 PDR'!$A$4:$A$5600,'05 CPD'!$A39,'07 PDR'!$L$4:$L$5600,'05 CPD'!AB$2))","v":""},{"$f":"IF(SUMIFS('07 PDR'!$F$4:$F$5600,'07 PDR'!$A$4:$A$5600,'05 CPD'!$A39,'07 PDR'!$L$4:$L$5600,'05 CPD'!AC$2)=0,\"\",SUMIFS('07 PDR'!$F$4:$F$5600,'07 PDR'!$A$4:$A$5600,'05 CPD'!$A39,'07 PDR'!$L$4:$L$5600,'05 CPD'!AC$2))","v":""},{"$f":"IF(SUMIFS('07 PDR'!$F$4:$F$5600,'07 PDR'!$A$4:$A$5600,'05 CPD'!$A39,'07 PDR'!$L$4:$L$5600,'05 CPD'!AD$2)=0,\"\",SUMIFS('07 PDR'!$F$4:$F$5600,'07 PDR'!$A$4:$A$5600,'05 CPD'!$A39,'07 PDR'!$L$4:$L$5600,'05 CPD'!AD$2))","v":""},{"$f":"IF(SUMIFS('07 PDR'!$F$4:$F$5600,'07 PDR'!$A$4:$A$5600,'05 CPD'!$A39,'07 PDR'!$L$4:$L$5600,'05 CPD'!AE$2)=0,\"\",SUMIFS('07 PDR'!$F$4:$F$5600,'07 PDR'!$A$4:$A$5600,'05 CPD'!$A39,'07 PDR'!$L$4:$L$5600,'05 CPD'!AE$2))","v":""},{"$f":"IF(SUMIFS('07 PDR'!$F$4:$F$5600,'07 PDR'!$A$4:$A$5600,'05 CPD'!$A39,'07 PDR'!$L$4:$L$5600,'05 CPD'!AF$2)=0,\"\",SUMIFS('07 PDR'!$F$4:$F$5600,'07 PDR'!$A$4:$A$5600,'05 CPD'!$A39,'07 PDR'!$L$4:$L$5600,'05 CPD'!AF$2))","v":""}]
["<Insert Period Range for Period 38>","","","",null,null,null,{"$f":"IF(SUMIFS('07 PDR'!$F$4:$F$5600,'07 PDR'!$A$4:$A$5600,'05 CPD'!$A40,'07 PDR'!$K$4:$K$5600,'05 CPD'!H$2)=0,\"\",SUMIFS('07 PDR'!$F$4:$F$5600,'07 PDR'!$A$4:$A$5600,'05 CPD'!$A40,'07 PDR'!$K$4:$K$5600,'05 CPD'!H$2))","v":""},{"$f":"IF(SUMIFS('07 PDR'!$F$4:$F$5600,'07 PDR'!$A$4:$A$5600,'05 CPD'!$A40,'07 PDR'!$K$4:$K$5600,'05 CPD'!I$2)=0,\"\",SUMIFS('07 PDR'!$F$4:$F$5600,'07 PDR'!$A$4:$A$5600,'05 CPD'!$A40,'07 PDR'!$K$4:$K$5600,'05 CPD'!I$2))","v":""},{"$f":"IF(SUMIFS('07 PDR'!$F$4:$F$5600,'07 PDR'!$A$4:$A$5600,'05 CPD'!$A40,'07 PDR'!$K$4:$K$5600,'05 CPD'!J$2)=0,\"\",SUMIFS('07 PDR'!$F$4:$F$5600,'07 PDR'!$A$4:$A$5600,'05 CPD'!$A40,'07 PDR'!$K$4:$K$5600,'05 CPD'!J$2))","v":""},{"$f":"IF(SUMIFS('07 PDR'!$F$4:$F$5600,'07 PDR'!$A$4:$A$5600,'05 CPD'!$A40,'07 PDR'!$K$4:$K$5600,'05 CPD'!K$2)=0,\"\",SUMIFS('07 PDR'!$F$4:$F$5600,'07 PDR'!$A$4:$A$5600,'05 CPD'!$A40,'07 PDR'!$K$4:$K$5600,'05 CPD'!K$2))","v":""},{"$f":"IF(SUMIFS('07 PDR'!$F$4:$F$5600,'07 PDR'!$A$4:$A$5600,'05 CPD'!$A40,'07 PDR'!$K$4:$K$5600,'05 CPD'!L$2)=0,\"\",SUMIFS('07 PDR'!$F$4:$F$5600,'07 PDR'!$A$4:$A$5600,'05 CPD'!$A40,'07 PDR'!$K$4:$K$5600,'05 CPD'!L$2))","v":""},{"$f":"IF(SUMIFS('07 PDR'!$F$4:$F$5600,'07 PDR'!$A$4:$A$5600,'05 CPD'!$A40,'07 PDR'!$K$4:$K$5600,'05 CPD'!M$2)=0,\"\",SUMIFS('07 PDR'!$F$4:$F$5600,'07 PDR'!$A$4:$A$5600,'05 CPD'!$A40,'07 PDR'!$K$4:$K$5600,'05 CPD'!M$2))","v":""},{"$f":"IF(SUMIFS('07 PDR'!$F$4:$F$5600,'07 PDR'!$A$4:$A$5600,'05 CPD'!$A40,'07 PDR'!$K$4:$K$5600,'05 CPD'!N$2)=0,\"\",SUMIFS('07 PDR'!$F$4:$F$5600,'07 PDR'!$A$4:$A$5600,'05 CPD'!$A40,'07 PDR'!$K$4:$K$5600,'05 CPD'!N$2))","v":""},{"$f":"IF(SUMIFS('07 PDR'!$F$4:$F$5600,'07 PDR'!$A$4:$A$5600,'05 CPD'!$A40,'07 PDR'!$K$4:$K$5600,'05 CPD'!O$2)=0,\"\",SUMIFS('07 PDR'!$F$4:$F$5600,'07 PDR'!$A$4:$A$5600,'05 CPD'!$A40,'07 PDR'!$K$4:$K$5600,'05 CPD'!O$2))","v":""},{"$f":"IF(SUMIFS('07 PDR'!$F$4:$F$5600,'07 PDR'!$A$4:$A$5600,'05 CPD'!$A40,'07 PDR'!$K$4:$K$5600,'05 CPD'!P$2)=0,\"\",SUMIFS('07 PDR'!$F$4:$F$5600,'07 PDR'!$A$4:$A$5600,'05 CPD'!$A40,'07 PDR'!$K$4:$K$5600,'05 CPD'!P$2))","v":""},{"$f":"IF(SUMIFS('07 PDR'!$F$4:$F$5600,'07 PDR'!$A$4:$A$5600,'05 CPD'!$A40,'07 PDR'!$K$4:$K$5600,'05 CPD'!Q$2)=0,\"\",SUMIFS('07 PDR'!$F$4:$F$5600,'07 PDR'!$A$4:$A$5600,'05 CPD'!$A40,'07 PDR'!$K$4:$K$5600,'05 CPD'!Q$2))","v":""},{"$f":"IF(SUMIFS('07 PDR'!$F$4:$F$5600,'07 PDR'!$A$4:$A$5600,'05 CPD'!$A40,'07 PDR'!$K$4:$K$5600,'05 CPD'!R$2)=0,\"\",SUMIFS('07 PDR'!$F$4:$F$5600,'07 PDR'!$A$4:$A$5600,'05 CPD'!$A40,'07 PDR'!$K$4:$K$5600,'05 CPD'!R$2))","v":""},null,{"$f":"IF(SUMIFS('07 PDR'!$F$4:$F$5600,'07 PDR'!$A$4:$A$5600,'05 CPD'!$A40,'07 PDR'!$L$4:$L$5600,'05 CPD'!T$2)=0,\"\",SUMIFS('07 PDR'!$F$4:$F$5600,'07 PDR'!$A$4:$A$5600,'05 CPD'!$A40,'07 PDR'!$L$4:$L$5600,'05 CPD'!T$2))","v":""},{"$f":"IF(SUMIFS('07 PDR'!$F$4:$F$5600,'07 PDR'!$A$4:$A$5600,'05 CPD'!$A40,'07 PDR'!$L$4:$L$5600,'05 CPD'!U$2)=0,\"\",SUMIFS('07 PDR'!$F$4:$F$5600,'07 PDR'!$A$4:$A$5600,'05 CPD'!$A40,'07 PDR'!$L$4:$L$5600,'05 CPD'!U$2))","v":""},{"$f":"IF(SUMIFS('07 PDR'!$F$4:$F$5600,'07 PDR'!$A$4:$A$5600,'05 CPD'!$A40,'07 PDR'!$L$4:$L$5600,'05 CPD'!V$2)=0,\"\",SUMIFS('07 PDR'!$F$4:$F$5600,'07 PDR'!$A$4:$A$5600,'05 CPD'!$A40,'07 PDR'!$L$4:$L$5600,'05 CPD'!V$2))","v":""},{"$f":"IF(SUMIFS('07 PDR'!$F$4:$F$5600,'07 PDR'!$A$4:$A$5600,'05 CPD'!$A40,'07 PDR'!$L$4:$L$5600,'05 CPD'!W$2)=0,\"\",SUMIFS('07 PDR'!$F$4:$F$5600,'07 PDR'!$A$4:$A$5600,'05 CPD'!$A40,'07 PDR'!$L$4:$L$5600,'05 CPD'!W$2))","v":""},{"$f":"IF(SUMIFS('07 PDR'!$F$4:$F$5600,'07 PDR'!$A$4:$A$5600,'05 CPD'!$A40,'07 PDR'!$L$4:$L$5600,'05 CPD'!X$2)=0,\"\",SUMIFS('07 PDR'!$F$4:$F$5600,'07 PDR'!$A$4:$A$5600,'05 CPD'!$A40,'07 PDR'!$L$4:$L$5600,'05 CPD'!X$2))","v":""},{"$f":"IF(SUMIFS('07 PDR'!$F$4:$F$5600,'07 PDR'!$A$4:$A$5600,'05 CPD'!$A40,'07 PDR'!$L$4:$L$5600,'05 CPD'!Y$2)=0,\"\",SUMIFS('07 PDR'!$F$4:$F$5600,'07 PDR'!$A$4:$A$5600,'05 CPD'!$A40,'07 PDR'!$L$4:$L$5600,'05 CPD'!Y$2))","v":""},{"$f":"IF(SUMIFS('07 PDR'!$F$4:$F$5600,'07 PDR'!$A$4:$A$5600,'05 CPD'!$A40,'07 PDR'!$L$4:$L$5600,'05 CPD'!Z$2)=0,\"\",SUMIFS('07 PDR'!$F$4:$F$5600,'07 PDR'!$A$4:$A$5600,'05 CPD'!$A40,'07 PDR'!$L$4:$L$5600,'05 CPD'!Z$2))","v":""},{"$f":"IF(SUMIFS('07 PDR'!$F$4:$F$5600,'07 PDR'!$A$4:$A$5600,'05 CPD'!$A40,'07 PDR'!$L$4:$L$5600,'05 CPD'!AA$2)=0,\"\",SUMIFS('07 PDR'!$F$4:$F$5600,'07 PDR'!$A$4:$A$5600,'05 CPD'!$A40,'07 PDR'!$L$4:$L$5600,'05 CPD'!AA$2))","v":""},{"$f":"IF(SUMIFS('07 PDR'!$F$4:$F$5600,'07 PDR'!$A$4:$A$5600,'05 CPD'!$A40,'07 PDR'!$L$4:$L$5600,'05 CPD'!AB$2)=0,\"\",SUMIFS('07 PDR'!$F$4:$F$5600,'07 PDR'!$A$4:$A$5600,'05 CPD'!$A40,'07 PDR'!$L$4:$L$5600,'05 CPD'!AB$2))","v":""},{"$f":"IF(SUMIFS('07 PDR'!$F$4:$F$5600,'07 PDR'!$A$4:$A$5600,'05 CPD'!$A40,'07 PDR'!$L$4:$L$5600,'05 CPD'!AC$2)=0,\"\",SUMIFS('07 PDR'!$F$4:$F$5600,'07 PDR'!$A$4:$A$5600,'05 CPD'!$A40,'07 PDR'!$L$4:$L$5600,'05 CPD'!AC$2))","v":""},{"$f":"IF(SUMIFS('07 PDR'!$F$4:$F$5600,'07 PDR'!$A$4:$A$5600,'05 CPD'!$A40,'07 PDR'!$L$4:$L$5600,'05 CPD'!AD$2)=0,\"\",SUMIFS('07 PDR'!$F$4:$F$5600,'07 PDR'!$A$4:$A$5600,'05 CPD'!$A40,'07 PDR'!$L$4:$L$5600,'05 CPD'!AD$2))","v":""},{"$f":"IF(SUMIFS('07 PDR'!$F$4:$F$5600,'07 PDR'!$A$4:$A$5600,'05 CPD'!$A40,'07 PDR'!$L$4:$L$5600,'05 CPD'!AE$2)=0,\"\",SUMIFS('07 PDR'!$F$4:$F$5600,'07 PDR'!$A$4:$A$5600,'05 CPD'!$A40,'07 PDR'!$L$4:$L$5600,'05 CPD'!AE$2))","v":""},{"$f":"IF(SUMIFS('07 PDR'!$F$4:$F$5600,'07 PDR'!$A$4:$A$5600,'05 CPD'!$A40,'07 PDR'!$L$4:$L$5600,'05 CPD'!AF$2)=0,\"\",SUMIFS('07 PDR'!$F$4:$F$5600,'07 PDR'!$A$4:$A$5600,'05 CPD'!$A40,'07 PDR'!$L$4:$L$5600,'05 CPD'!AF$2))","v":""}]
["<Insert Period Range for Period 39>","","","",null,null,null,{"$f":"IF(SUMIFS('07 PDR'!$F$4:$F$5600,'07 PDR'!$A$4:$A$5600,'05 CPD'!$A41,'07 PDR'!$K$4:$K$5600,'05 CPD'!H$2)=0,\"\",SUMIFS('07 PDR'!$F$4:$F$5600,'07 PDR'!$A$4:$A$5600,'05 CPD'!$A41,'07 PDR'!$K$4:$K$5600,'05 CPD'!H$2))","v":""},{"$f":"IF(SUMIFS('07 PDR'!$F$4:$F$5600,'07 PDR'!$A$4:$A$5600,'05 CPD'!$A41,'07 PDR'!$K$4:$K$5600,'05 CPD'!I$2)=0,\"\",SUMIFS('07 PDR'!$F$4:$F$5600,'07 PDR'!$A$4:$A$5600,'05 CPD'!$A41,'07 PDR'!$K$4:$K$5600,'05 CPD'!I$2))","v":""},{"$f":"IF(SUMIFS('07 PDR'!$F$4:$F$5600,'07 PDR'!$A$4:$A$5600,'05 CPD'!$A41,'07 PDR'!$K$4:$K$5600,'05 CPD'!J$2)=0,\"\",SUMIFS('07 PDR'!$F$4:$F$5600,'07 PDR'!$A$4:$A$5600,'05 CPD'!$A41,'07 PDR'!$K$4:$K$5600,'05 CPD'!J$2))","v":""},{"$f":"IF(SUMIFS('07 PDR'!$F$4:$F$5600,'07 PDR'!$A$4:$A$5600,'05 CPD'!$A41,'07 PDR'!$K$4:$K$5600,'05 CPD'!K$2)=0,\"\",SUMIFS('07 PDR'!$F$4:$F$5600,'07 PDR'!$A$4:$A$5600,'05 CPD'!$A41,'07 PDR'!$K$4:$K$5600,'05 CPD'!K$2))","v":""},{"$f":"IF(SUMIFS('07 PDR'!$F$4:$F$5600,'07 PDR'!$A$4:$A$5600,'05 CPD'!$A41,'07 PDR'!$K$4:$K$5600,'05 CPD'!L$2)=0,\"\",SUMIFS('07 PDR'!$F$4:$F$5600,'07 PDR'!$A$4:$A$5600,'05 CPD'!$A41,'07 PDR'!$K$4:$K$5600,'05 CPD'!L$2))","v":""},{"$f":"IF(SUMIFS('07 PDR'!$F$4:$F$5600,'07 PDR'!$A$4:$A$5600,'05 CPD'!$A41,'07 PDR'!$K$4:$K$5600,'05 CPD'!M$2)=0,\"\",SUMIFS('07 PDR'!$F$4:$F$5600,'07 PDR'!$A$4:$A$5600,'05 CPD'!$A41,'07 PDR'!$K$4:$K$5600,'05 CPD'!M$2))","v":""},{"$f":"IF(SUMIFS('07 PDR'!$F$4:$F$5600,'07 PDR'!$A$4:$A$5600,'05 CPD'!$A41,'07 PDR'!$K$4:$K$5600,'05 CPD'!N$2)=0,\"\",SUMIFS('07 PDR'!$F$4:$F$5600,'07 PDR'!$A$4:$A$5600,'05 CPD'!$A41,'07 PDR'!$K$4:$K$5600,'05 CPD'!N$2))","v":""},{"$f":"IF(SUMIFS('07 PDR'!$F$4:$F$5600,'07 PDR'!$A$4:$A$5600,'05 CPD'!$A41,'07 PDR'!$K$4:$K$5600,'05 CPD'!O$2)=0,\"\",SUMIFS('07 PDR'!$F$4:$F$5600,'07 PDR'!$A$4:$A$5600,'05 CPD'!$A41,'07 PDR'!$K$4:$K$5600,'05 CPD'!O$2))","v":""},{"$f":"IF(SUMIFS('07 PDR'!$F$4:$F$5600,'07 PDR'!$A$4:$A$5600,'05 CPD'!$A41,'07 PDR'!$K$4:$K$5600,'05 CPD'!P$2)=0,\"\",SUMIFS('07 PDR'!$F$4:$F$5600,'07 PDR'!$A$4:$A$5600,'05 CPD'!$A41,'07 PDR'!$K$4:$K$5600,'05 CPD'!P$2))","v":""},{"$f":"IF(SUMIFS('07 PDR'!$F$4:$F$5600,'07 PDR'!$A$4:$A$5600,'05 CPD'!$A41,'07 PDR'!$K$4:$K$5600,'05 CPD'!Q$2)=0,\"\",SUMIFS('07 PDR'!$F$4:$F$5600,'07 PDR'!$A$4:$A$5600,'05 CPD'!$A41,'07 PDR'!$K$4:$K$5600,'05 CPD'!Q$2))","v":""},{"$f":"IF(SUMIFS('07 PDR'!$F$4:$F$5600,'07 PDR'!$A$4:$A$5600,'05 CPD'!$A41,'07 PDR'!$K$4:$K$5600,'05 CPD'!R$2)=0,\"\",SUMIFS('07 PDR'!$F$4:$F$5600,'07 PDR'!$A$4:$A$5600,'05 CPD'!$A41,'07 PDR'!$K$4:$K$5600,'05 CPD'!R$2))","v":""},null,{"$f":"IF(SUMIFS('07 PDR'!$F$4:$F$5600,'07 PDR'!$A$4:$A$5600,'05 CPD'!$A41,'07 PDR'!$L$4:$L$5600,'05 CPD'!T$2)=0,\"\",SUMIFS('07 PDR'!$F$4:$F$5600,'07 PDR'!$A$4:$A$5600,'05 CPD'!$A41,'07 PDR'!$L$4:$L$5600,'05 CPD'!T$2))","v":""},{"$f":"IF(SUMIFS('07 PDR'!$F$4:$F$5600,'07 PDR'!$A$4:$A$5600,'05 CPD'!$A41,'07 PDR'!$L$4:$L$5600,'05 CPD'!U$2)=0,\"\",SUMIFS('07 PDR'!$F$4:$F$5600,'07 PDR'!$A$4:$A$5600,'05 CPD'!$A41,'07 PDR'!$L$4:$L$5600,'05 CPD'!U$2))","v":""},{"$f":"IF(SUMIFS('07 PDR'!$F$4:$F$5600,'07 PDR'!$A$4:$A$5600,'05 CPD'!$A41,'07 PDR'!$L$4:$L$5600,'05 CPD'!V$2)=0,\"\",SUMIFS('07 PDR'!$F$4:$F$5600,'07 PDR'!$A$4:$A$5600,'05 CPD'!$A41,'07 PDR'!$L$4:$L$5600,'05 CPD'!V$2))","v":""},{"$f":"IF(SUMIFS('07 PDR'!$F$4:$F$5600,'07 PDR'!$A$4:$A$5600,'05 CPD'!$A41,'07 PDR'!$L$4:$L$5600,'05 CPD'!W$2)=0,\"\",SUMIFS('07 PDR'!$F$4:$F$5600,'07 PDR'!$A$4:$A$5600,'05 CPD'!$A41,'07 PDR'!$L$4:$L$5600,'05 CPD'!W$2))","v":""},{"$f":"IF(SUMIFS('07 PDR'!$F$4:$F$5600,'07 PDR'!$A$4:$A$5600,'05 CPD'!$A41,'07 PDR'!$L$4:$L$5600,'05 CPD'!X$2)=0,\"\",SUMIFS('07 PDR'!$F$4:$F$5600,'07 PDR'!$A$4:$A$5600,'05 CPD'!$A41,'07 PDR'!$L$4:$L$5600,'05 CPD'!X$2))","v":""},{"$f":"IF(SUMIFS('07 PDR'!$F$4:$F$5600,'07 PDR'!$A$4:$A$5600,'05 CPD'!$A41,'07 PDR'!$L$4:$L$5600,'05 CPD'!Y$2)=0,\"\",SUMIFS('07 PDR'!$F$4:$F$5600,'07 PDR'!$A$4:$A$5600,'05 CPD'!$A41,'07 PDR'!$L$4:$L$5600,'05 CPD'!Y$2))","v":""},{"$f":"IF(SUMIFS('07 PDR'!$F$4:$F$5600,'07 PDR'!$A$4:$A$5600,'05 CPD'!$A41,'07 PDR'!$L$4:$L$5600,'05 CPD'!Z$2)=0,\"\",SUMIFS('07 PDR'!$F$4:$F$5600,'07 PDR'!$A$4:$A$5600,'05 CPD'!$A41,'07 PDR'!$L$4:$L$5600,'05 CPD'!Z$2))","v":""},{"$f":"IF(SUMIFS('07 PDR'!$F$4:$F$5600,'07 PDR'!$A$4:$A$5600,'05 CPD'!$A41,'07 PDR'!$L$4:$L$5600,'05 CPD'!AA$2)=0,\"\",SUMIFS('07 PDR'!$F$4:$F$5600,'07 PDR'!$A$4:$A$5600,'05 CPD'!$A41,'07 PDR'!$L$4:$L$5600,'05 CPD'!AA$2))","v":""},{"$f":"IF(SUMIFS('07 PDR'!$F$4:$F$5600,'07 PDR'!$A$4:$A$5600,'05 CPD'!$A41,'07 PDR'!$L$4:$L$5600,'05 CPD'!AB$2)=0,\"\",SUMIFS('07 PDR'!$F$4:$F$5600,'07 PDR'!$A$4:$A$5600,'05 CPD'!$A41,'07 PDR'!$L$4:$L$5600,'05 CPD'!AB$2))","v":""},{"$f":"IF(SUMIFS('07 PDR'!$F$4:$F$5600,'07 PDR'!$A$4:$A$5600,'05 CPD'!$A41,'07 PDR'!$L$4:$L$5600,'05 CPD'!AC$2)=0,\"\",SUMIFS('07 PDR'!$F$4:$F$5600,'07 PDR'!$A$4:$A$5600,'05 CPD'!$A41,'07 PDR'!$L$4:$L$5600,'05 CPD'!AC$2))","v":""},{"$f":"IF(SUMIFS('07 PDR'!$F$4:$F$5600,'07 PDR'!$A$4:$A$5600,'05 CPD'!$A41,'07 PDR'!$L$4:$L$5600,'05 CPD'!AD$2)=0,\"\",SUMIFS('07 PDR'!$F$4:$F$5600,'07 PDR'!$A$4:$A$5600,'05 CPD'!$A41,'07 PDR'!$L$4:$L$5600,'05 CPD'!AD$2))","v":""},{"$f":"IF(SUMIFS('07 PDR'!$F$4:$F$5600,'07 PDR'!$A$4:$A$5600,'05 CPD'!$A41,'07 PDR'!$L$4:$L$5600,'05 CPD'!AE$2)=0,\"\",SUMIFS('07 PDR'!$F$4:$F$5600,'07 PDR'!$A$4:$A$5600,'05 CPD'!$A41,'07 PDR'!$L$4:$L$5600,'05 CPD'!AE$2))","v":""},{"$f":"IF(SUMIFS('07 PDR'!$F$4:$F$5600,'07 PDR'!$A$4:$A$5600,'05 CPD'!$A41,'07 PDR'!$L$4:$L$5600,'05 CPD'!AF$2)=0,\"\",SUMIFS('07 PDR'!$F$4:$F$5600,'07 PDR'!$A$4:$A$5600,'05 CPD'!$A41,'07 PDR'!$L$4:$L$5600,'05 CPD'!AF$2))","v":""}]
["<Insert Period Range for Period 40>","","","",null,null,null,{"$f":"IF(SUMIFS('07 PDR'!$F$4:$F$5600,'07 PDR'!$A$4:$A$5600,'05 CPD'!$A42,'07 PDR'!$K$4:$K$5600,'05 CPD'!H$2)=0,\"\",SUMIFS('07 PDR'!$F$4:$F$5600,'07 PDR'!$A$4:$A$5600,'05 CPD'!$A42,'07 PDR'!$K$4:$K$5600,'05 CPD'!H$2))","v":""},{"$f":"IF(SUMIFS('07 PDR'!$F$4:$F$5600,'07 PDR'!$A$4:$A$5600,'05 CPD'!$A42,'07 PDR'!$K$4:$K$5600,'05 CPD'!I$2)=0,\"\",SUMIFS('07 PDR'!$F$4:$F$5600,'07 PDR'!$A$4:$A$5600,'05 CPD'!$A42,'07 PDR'!$K$4:$K$5600,'05 CPD'!I$2))","v":""},{"$f":"IF(SUMIFS('07 PDR'!$F$4:$F$5600,'07 PDR'!$A$4:$A$5600,'05 CPD'!$A42,'07 PDR'!$K$4:$K$5600,'05 CPD'!J$2)=0,\"\",SUMIFS('07 PDR'!$F$4:$F$5600,'07 PDR'!$A$4:$A$5600,'05 CPD'!$A42,'07 PDR'!$K$4:$K$5600,'05 CPD'!J$2))","v":""},{"$f":"IF(SUMIFS('07 PDR'!$F$4:$F$5600,'07 PDR'!$A$4:$A$5600,'05 CPD'!$A42,'07 PDR'!$K$4:$K$5600,'05 CPD'!K$2)=0,\"\",SUMIFS('07 PDR'!$F$4:$F$5600,'07 PDR'!$A$4:$A$5600,'05 CPD'!$A42,'07 PDR'!$K$4:$K$5600,'05 CPD'!K$2))","v":""},{"$f":"IF(SUMIFS('07 PDR'!$F$4:$F$5600,'07 PDR'!$A$4:$A$5600,'05 CPD'!$A42,'07 PDR'!$K$4:$K$5600,'05 CPD'!L$2)=0,\"\",SUMIFS('07 PDR'!$F$4:$F$5600,'07 PDR'!$A$4:$A$5600,'05 CPD'!$A42,'07 PDR'!$K$4:$K$5600,'05 CPD'!L$2))","v":""},{"$f":"IF(SUMIFS('07 PDR'!$F$4:$F$5600,'07 PDR'!$A$4:$A$5600,'05 CPD'!$A42,'07 PDR'!$K$4:$K$5600,'05 CPD'!M$2)=0,\"\",SUMIFS('07 PDR'!$F$4:$F$5600,'07 PDR'!$A$4:$A$5600,'05 CPD'!$A42,'07 PDR'!$K$4:$K$5600,'05 CPD'!M$2))","v":""},{"$f":"IF(SUMIFS('07 PDR'!$F$4:$F$5600,'07 PDR'!$A$4:$A$5600,'05 CPD'!$A42,'07 PDR'!$K$4:$K$5600,'05 CPD'!N$2)=0,\"\",SUMIFS('07 PDR'!$F$4:$F$5600,'07 PDR'!$A$4:$A$5600,'05 CPD'!$A42,'07 PDR'!$K$4:$K$5600,'05 CPD'!N$2))","v":""},{"$f":"IF(SUMIFS('07 PDR'!$F$4:$F$5600,'07 PDR'!$A$4:$A$5600,'05 CPD'!$A42,'07 PDR'!$K$4:$K$5600,'05 CPD'!O$2)=0,\"\",SUMIFS('07 PDR'!$F$4:$F$5600,'07 PDR'!$A$4:$A$5600,'05 CPD'!$A42,'07 PDR'!$K$4:$K$5600,'05 CPD'!O$2))","v":""},{"$f":"IF(SUMIFS('07 PDR'!$F$4:$F$5600,'07 PDR'!$A$4:$A$5600,'05 CPD'!$A42,'07 PDR'!$K$4:$K$5600,'05 CPD'!P$2)=0,\"\",SUMIFS('07 PDR'!$F$4:$F$5600,'07 PDR'!$A$4:$A$5600,'05 CPD'!$A42,'07 PDR'!$K$4:$K$5600,'05 CPD'!P$2))","v":""},{"$f":"IF(SUMIFS('07 PDR'!$F$4:$F$5600,'07 PDR'!$A$4:$A$5600,'05 CPD'!$A42,'07 PDR'!$K$4:$K$5600,'05 CPD'!Q$2)=0,\"\",SUMIFS('07 PDR'!$F$4:$F$5600,'07 PDR'!$A$4:$A$5600,'05 CPD'!$A42,'07 PDR'!$K$4:$K$5600,'05 CPD'!Q$2))","v":""},{"$f":"IF(SUMIFS('07 PDR'!$F$4:$F$5600,'07 PDR'!$A$4:$A$5600,'05 CPD'!$A42,'07 PDR'!$K$4:$K$5600,'05 CPD'!R$2)=0,\"\",SUMIFS('07 PDR'!$F$4:$F$5600,'07 PDR'!$A$4:$A$5600,'05 CPD'!$A42,'07 PDR'!$K$4:$K$5600,'05 CPD'!R$2))","v":""},null,{"$f":"IF(SUMIFS('07 PDR'!$F$4:$F$5600,'07 PDR'!$A$4:$A$5600,'05 CPD'!$A42,'07 PDR'!$L$4:$L$5600,'05 CPD'!T$2)=0,\"\",SUMIFS('07 PDR'!$F$4:$F$5600,'07 PDR'!$A$4:$A$5600,'05 CPD'!$A42,'07 PDR'!$L$4:$L$5600,'05 CPD'!T$2))","v":""},{"$f":"IF(SUMIFS('07 PDR'!$F$4:$F$5600,'07 PDR'!$A$4:$A$5600,'05 CPD'!$A42,'07 PDR'!$L$4:$L$5600,'05 CPD'!U$2)=0,\"\",SUMIFS('07 PDR'!$F$4:$F$5600,'07 PDR'!$A$4:$A$5600,'05 CPD'!$A42,'07 PDR'!$L$4:$L$5600,'05 CPD'!U$2))","v":""},{"$f":"IF(SUMIFS('07 PDR'!$F$4:$F$5600,'07 PDR'!$A$4:$A$5600,'05 CPD'!$A42,'07 PDR'!$L$4:$L$5600,'05 CPD'!V$2)=0,\"\",SUMIFS('07 PDR'!$F$4:$F$5600,'07 PDR'!$A$4:$A$5600,'05 CPD'!$A42,'07 PDR'!$L$4:$L$5600,'05 CPD'!V$2))","v":""},{"$f":"IF(SUMIFS('07 PDR'!$F$4:$F$5600,'07 PDR'!$A$4:$A$5600,'05 CPD'!$A42,'07 PDR'!$L$4:$L$5600,'05 CPD'!W$2)=0,\"\",SUMIFS('07 PDR'!$F$4:$F$5600,'07 PDR'!$A$4:$A$5600,'05 CPD'!$A42,'07 PDR'!$L$4:$L$5600,'05 CPD'!W$2))","v":""},{"$f":"IF(SUMIFS('07 PDR'!$F$4:$F$5600,'07 PDR'!$A$4:$A$5600,'05 CPD'!$A42,'07 PDR'!$L$4:$L$5600,'05 CPD'!X$2)=0,\"\",SUMIFS('07 PDR'!$F$4:$F$5600,'07 PDR'!$A$4:$A$5600,'05 CPD'!$A42,'07 PDR'!$L$4:$L$5600,'05 CPD'!X$2))","v":""},{"$f":"IF(SUMIFS('07 PDR'!$F$4:$F$5600,'07 PDR'!$A$4:$A$5600,'05 CPD'!$A42,'07 PDR'!$L$4:$L$5600,'05 CPD'!Y$2)=0,\"\",SUMIFS('07 PDR'!$F$4:$F$5600,'07 PDR'!$A$4:$A$5600,'05 CPD'!$A42,'07 PDR'!$L$4:$L$5600,'05 CPD'!Y$2))","v":""},{"$f":"IF(SUMIFS('07 PDR'!$F$4:$F$5600,'07 PDR'!$A$4:$A$5600,'05 CPD'!$A42,'07 PDR'!$L$4:$L$5600,'05 CPD'!Z$2)=0,\"\",SUMIFS('07 PDR'!$F$4:$F$5600,'07 PDR'!$A$4:$A$5600,'05 CPD'!$A42,'07 PDR'!$L$4:$L$5600,'05 CPD'!Z$2))","v":""},{"$f":"IF(SUMIFS('07 PDR'!$F$4:$F$5600,'07 PDR'!$A$4:$A$5600,'05 CPD'!$A42,'07 PDR'!$L$4:$L$5600,'05 CPD'!AA$2)=0,\"\",SUMIFS('07 PDR'!$F$4:$F$5600,'07 PDR'!$A$4:$A$5600,'05 CPD'!$A42,'07 PDR'!$L$4:$L$5600,'05 CPD'!AA$2))","v":""},{"$f":"IF(SUMIFS('07 PDR'!$F$4:$F$5600,'07 PDR'!$A$4:$A$5600,'05 CPD'!$A42,'07 PDR'!$L$4:$L$5600,'05 CPD'!AB$2)=0,\"\",SUMIFS('07 PDR'!$F$4:$F$5600,'07 PDR'!$A$4:$A$5600,'05 CPD'!$A42,'07 PDR'!$L$4:$L$5600,'05 CPD'!AB$2))","v":""},{"$f":"IF(SUMIFS('07 PDR'!$F$4:$F$5600,'07 PDR'!$A$4:$A$5600,'05 CPD'!$A42,'07 PDR'!$L$4:$L$5600,'05 CPD'!AC$2)=0,\"\",SUMIFS('07 PDR'!$F$4:$F$5600,'07 PDR'!$A$4:$A$5600,'05 CPD'!$A42,'07 PDR'!$L$4:$L$5600,'05 CPD'!AC$2))","v":""},{"$f":"IF(SUMIFS('07 PDR'!$F$4:$F$5600,'07 PDR'!$A$4:$A$5600,'05 CPD'!$A42,'07 PDR'!$L$4:$L$5600,'05 CPD'!AD$2)=0,\"\",SUMIFS('07 PDR'!$F$4:$F$5600,'07 PDR'!$A$4:$A$5600,'05 CPD'!$A42,'07 PDR'!$L$4:$L$5600,'05 CPD'!AD$2))","v":""},{"$f":"IF(SUMIFS('07 PDR'!$F$4:$F$5600,'07 PDR'!$A$4:$A$5600,'05 CPD'!$A42,'07 PDR'!$L$4:$L$5600,'05 CPD'!AE$2)=0,\"\",SUMIFS('07 PDR'!$F$4:$F$5600,'07 PDR'!$A$4:$A$5600,'05 CPD'!$A42,'07 PDR'!$L$4:$L$5600,'05 CPD'!AE$2))","v":""},{"$f":"IF(SUMIFS('07 PDR'!$F$4:$F$5600,'07 PDR'!$A$4:$A$5600,'05 CPD'!$A42,'07 PDR'!$L$4:$L$5600,'05 CPD'!AF$2)=0,\"\",SUMIFS('07 PDR'!$F$4:$F$5600,'07 PDR'!$A$4:$A$5600,'05 CPD'!$A42,'07 PDR'!$L$4:$L$5600,'05 CPD'!AF$2))","v":""}]
["<Insert Period Range for Period 41>","","","",null,null,null,{"$f":"IF(SUMIFS('07 PDR'!$F$4:$F$5600,'07 PDR'!$A$4:$A$5600,'05 CPD'!$A43,'07 PDR'!$K$4:$K$5600,'05 CPD'!H$2)=0,\"\",SUMIFS('07 PDR'!$F$4:$F$5600,'07 PDR'!$A$4:$A$5600,'05 CPD'!$A43,'07 PDR'!$K$4:$K$5600,'05 CPD'!H$2))","v":""},{"$f":"IF(SUMIFS('07 PDR'!$F$4:$F$5600,'07 PDR'!$A$4:$A$5600,'05 CPD'!$A43,'07 PDR'!$K$4:$K$5600,'05 CPD'!I$2)=0,\"\",SUMIFS('07 PDR'!$F$4:$F$5600,'07 PDR'!$A$4:$A$5600,'05 CPD'!$A43,'07 PDR'!$K$4:$K$5600,'05 CPD'!I$2))","v":""},{"$f":"IF(SUMIFS('07 PDR'!$F$4:$F$5600,'07 PDR'!$A$4:$A$5600,'05 CPD'!$A43,'07 PDR'!$K$4:$K$5600,'05 CPD'!J$2)=0,\"\",SUMIFS('07 PDR'!$F$4:$F$5600,'07 PDR'!$A$4:$A$5600,'05 CPD'!$A43,'07 PDR'!$K$4:$K$5600,'05 CPD'!J$2))","v":""},{"$f":"IF(SUMIFS('07 PDR'!$F$4:$F$5600,'07 PDR'!$A$4:$A$5600,'05 CPD'!$A43,'07 PDR'!$K$4:$K$5600,'05 CPD'!K$2)=0,\"\",SUMIFS('07 PDR'!$F$4:$F$5600,'07 PDR'!$A$4:$A$5600,'05 CPD'!$A43,'07 PDR'!$K$4:$K$5600,'05 CPD'!K$2))","v":""},{"$f":"IF(SUMIFS('07 PDR'!$F$4:$F$5600,'07 PDR'!$A$4:$A$5600,'05 CPD'!$A43,'07 PDR'!$K$4:$K$5600,'05 CPD'!L$2)=0,\"\",SUMIFS('07 PDR'!$F$4:$F$5600,'07 PDR'!$A$4:$A$5600,'05 CPD'!$A43,'07 PDR'!$K$4:$K$5600,'05 CPD'!L$2))","v":""},{"$f":"IF(SUMIFS('07 PDR'!$F$4:$F$5600,'07 PDR'!$A$4:$A$5600,'05 CPD'!$A43,'07 PDR'!$K$4:$K$5600,'05 CPD'!M$2)=0,\"\",SUMIFS('07 PDR'!$F$4:$F$5600,'07 PDR'!$A$4:$A$5600,'05 CPD'!$A43,'07 PDR'!$K$4:$K$5600,'05 CPD'!M$2))","v":""},{"$f":"IF(SUMIFS('07 PDR'!$F$4:$F$5600,'07 PDR'!$A$4:$A$5600,'05 CPD'!$A43,'07 PDR'!$K$4:$K$5600,'05 CPD'!N$2)=0,\"\",SUMIFS('07 PDR'!$F$4:$F$5600,'07 PDR'!$A$4:$A$5600,'05 CPD'!$A43,'07 PDR'!$K$4:$K$5600,'05 CPD'!N$2))","v":""},{"$f":"IF(SUMIFS('07 PDR'!$F$4:$F$5600,'07 PDR'!$A$4:$A$5600,'05 CPD'!$A43,'07 PDR'!$K$4:$K$5600,'05 CPD'!O$2)=0,\"\",SUMIFS('07 PDR'!$F$4:$F$5600,'07 PDR'!$A$4:$A$5600,'05 CPD'!$A43,'07 PDR'!$K$4:$K$5600,'05 CPD'!O$2))","v":""},{"$f":"IF(SUMIFS('07 PDR'!$F$4:$F$5600,'07 PDR'!$A$4:$A$5600,'05 CPD'!$A43,'07 PDR'!$K$4:$K$5600,'05 CPD'!P$2)=0,\"\",SUMIFS('07 PDR'!$F$4:$F$5600,'07 PDR'!$A$4:$A$5600,'05 CPD'!$A43,'07 PDR'!$K$4:$K$5600,'05 CPD'!P$2))","v":""},{"$f":"IF(SUMIFS('07 PDR'!$F$4:$F$5600,'07 PDR'!$A$4:$A$5600,'05 CPD'!$A43,'07 PDR'!$K$4:$K$5600,'05 CPD'!Q$2)=0,\"\",SUMIFS('07 PDR'!$F$4:$F$5600,'07 PDR'!$A$4:$A$5600,'05 CPD'!$A43,'07 PDR'!$K$4:$K$5600,'05 CPD'!Q$2))","v":""},{"$f":"IF(SUMIFS('07 PDR'!$F$4:$F$5600,'07 PDR'!$A$4:$A$5600,'05 CPD'!$A43,'07 PDR'!$K$4:$K$5600,'05 CPD'!R$2)=0,\"\",SUMIFS('07 PDR'!$F$4:$F$5600,'07 PDR'!$A$4:$A$5600,'05 CPD'!$A43,'07 PDR'!$K$4:$K$5600,'05 CPD'!R$2))","v":""},null,{"$f":"IF(SUMIFS('07 PDR'!$F$4:$F$5600,'07 PDR'!$A$4:$A$5600,'05 CPD'!$A43,'07 PDR'!$L$4:$L$5600,'05 CPD'!T$2)=0,\"\",SUMIFS('07 PDR'!$F$4:$F$5600,'07 PDR'!$A$4:$A$5600,'05 CPD'!$A43,'07 PDR'!$L$4:$L$5600,'05 CPD'!T$2))","v":""},{"$f":"IF(SUMIFS('07 PDR'!$F$4:$F$5600,'07 PDR'!$A$4:$A$5600,'05 CPD'!$A43,'07 PDR'!$L$4:$L$5600,'05 CPD'!U$2)=0,\"\",SUMIFS('07 PDR'!$F$4:$F$5600,'07 PDR'!$A$4:$A$5600,'05 CPD'!$A43,'07 PDR'!$L$4:$L$5600,'05 CPD'!U$2))","v":""},{"$f":"IF(SUMIFS('07 PDR'!$F$4:$F$5600,'07 PDR'!$A$4:$A$5600,'05 CPD'!$A43,'07 PDR'!$L$4:$L$5600,'05 CPD'!V$2)=0,\"\",SUMIFS('07 PDR'!$F$4:$F$5600,'07 PDR'!$A$4:$A$5600,'05 CPD'!$A43,'07 PDR'!$L$4:$L$5600,'05 CPD'!V$2))","v":""},{"$f":"IF(SUMIFS('07 PDR'!$F$4:$F$5600,'07 PDR'!$A$4:$A$5600,'05 CPD'!$A43,'07 PDR'!$L$4:$L$5600,'05 CPD'!W$2)=0,\"\",SUMIFS('07 PDR'!$F$4:$F$5600,'07 PDR'!$A$4:$A$5600,'05 CPD'!$A43,'07 PDR'!$L$4:$L$5600,'05 CPD'!W$2))","v":""},{"$f":"IF(SUMIFS('07 PDR'!$F$4:$F$5600,'07 PDR'!$A$4:$A$5600,'05 CPD'!$A43,'07 PDR'!$L$4:$L$5600,'05 CPD'!X$2)=0,\"\",SUMIFS('07 PDR'!$F$4:$F$5600,'07 PDR'!$A$4:$A$5600,'05 CPD'!$A43,'07 PDR'!$L$4:$L$5600,'05 CPD'!X$2))","v":""},{"$f":"IF(SUMIFS('07 PDR'!$F$4:$F$5600,'07 PDR'!$A$4:$A$5600,'05 CPD'!$A43,'07 PDR'!$L$4:$L$5600,'05 CPD'!Y$2)=0,\"\",SUMIFS('07 PDR'!$F$4:$F$5600,'07 PDR'!$A$4:$A$5600,'05 CPD'!$A43,'07 PDR'!$L$4:$L$5600,'05 CPD'!Y$2))","v":""},{"$f":"IF(SUMIFS('07 PDR'!$F$4:$F$5600,'07 PDR'!$A$4:$A$5600,'05 CPD'!$A43,'07 PDR'!$L$4:$L$5600,'05 CPD'!Z$2)=0,\"\",SUMIFS('07 PDR'!$F$4:$F$5600,'07 PDR'!$A$4:$A$5600,'05 CPD'!$A43,'07 PDR'!$L$4:$L$5600,'05 CPD'!Z$2))","v":""},{"$f":"IF(SUMIFS('07 PDR'!$F$4:$F$5600,'07 PDR'!$A$4:$A$5600,'05 CPD'!$A43,'07 PDR'!$L$4:$L$5600,'05 CPD'!AA$2)=0,\"\",SUMIFS('07 PDR'!$F$4:$F$5600,'07 PDR'!$A$4:$A$5600,'05 CPD'!$A43,'07 PDR'!$L$4:$L$5600,'05 CPD'!AA$2))","v":""},{"$f":"IF(SUMIFS('07 PDR'!$F$4:$F$5600,'07 PDR'!$A$4:$A$5600,'05 CPD'!$A43,'07 PDR'!$L$4:$L$5600,'05 CPD'!AB$2)=0,\"\",SUMIFS('07 PDR'!$F$4:$F$5600,'07 PDR'!$A$4:$A$5600,'05 CPD'!$A43,'07 PDR'!$L$4:$L$5600,'05 CPD'!AB$2))","v":""},{"$f":"IF(SUMIFS('07 PDR'!$F$4:$F$5600,'07 PDR'!$A$4:$A$5600,'05 CPD'!$A43,'07 PDR'!$L$4:$L$5600,'05 CPD'!AC$2)=0,\"\",SUMIFS('07 PDR'!$F$4:$F$5600,'07 PDR'!$A$4:$A$5600,'05 CPD'!$A43,'07 PDR'!$L$4:$L$5600,'05 CPD'!AC$2))","v":""},{"$f":"IF(SUMIFS('07 PDR'!$F$4:$F$5600,'07 PDR'!$A$4:$A$5600,'05 CPD'!$A43,'07 PDR'!$L$4:$L$5600,'05 CPD'!AD$2)=0,\"\",SUMIFS('07 PDR'!$F$4:$F$5600,'07 PDR'!$A$4:$A$5600,'05 CPD'!$A43,'07 PDR'!$L$4:$L$5600,'05 CPD'!AD$2))","v":""},{"$f":"IF(SUMIFS('07 PDR'!$F$4:$F$5600,'07 PDR'!$A$4:$A$5600,'05 CPD'!$A43,'07 PDR'!$L$4:$L$5600,'05 CPD'!AE$2)=0,\"\",SUMIFS('07 PDR'!$F$4:$F$5600,'07 PDR'!$A$4:$A$5600,'05 CPD'!$A43,'07 PDR'!$L$4:$L$5600,'05 CPD'!AE$2))","v":""},{"$f":"IF(SUMIFS('07 PDR'!$F$4:$F$5600,'07 PDR'!$A$4:$A$5600,'05 CPD'!$A43,'07 PDR'!$L$4:$L$5600,'05 CPD'!AF$2)=0,\"\",SUMIFS('07 PDR'!$F$4:$F$5600,'07 PDR'!$A$4:$A$5600,'05 CPD'!$A43,'07 PDR'!$L$4:$L$5600,'05 CPD'!AF$2))","v":""}]
["<Insert Period Range for Period 42>",{"$f":"IF(SUM(H44:R44)=0,\"\",SUM(H44:R44))","v":""},{"$f":"IF(B44=\"\",\"\",(B44/8))","v":""},{"$f":"IF(B44=\"\",\"\",(B44+D43))","v":""},null,null,null,{"$f":"IF(SUMIFS('07 PDR'!$F$4:$F$5600,'07 PDR'!$A$4:$A$5600,'05 CPD'!$A44,'07 PDR'!$K$4:$K$5600,'05 CPD'!H$2)=0,\"\",SUMIFS('07 PDR'!$F$4:$F$5600,'07 PDR'!$A$4:$A$5600,'05 CPD'!$A44,'07 PDR'!$K$4:$K$5600,'05 CPD'!H$2))","v":""},{"$f":"IF(SUMIFS('07 PDR'!$F$4:$F$5600,'07 PDR'!$A$4:$A$5600,'05 CPD'!$A44,'07 PDR'!$K$4:$K$5600,'05 CPD'!I$2)=0,\"\",SUMIFS('07 PDR'!$F$4:$F$5600,'07 PDR'!$A$4:$A$5600,'05 CPD'!$A44,'07 PDR'!$K$4:$K$5600,'05 CPD'!I$2))","v":""},{"$f":"IF(SUMIFS('07 PDR'!$F$4:$F$5600,'07 PDR'!$A$4:$A$5600,'05 CPD'!$A44,'07 PDR'!$K$4:$K$5600,'05 CPD'!J$2)=0,\"\",SUMIFS('07 PDR'!$F$4:$F$5600,'07 PDR'!$A$4:$A$5600,'05 CPD'!$A44,'07 PDR'!$K$4:$K$5600,'05 CPD'!J$2))","v":""},{"$f":"IF(SUMIFS('07 PDR'!$F$4:$F$5600,'07 PDR'!$A$4:$A$5600,'05 CPD'!$A44,'07 PDR'!$K$4:$K$5600,'05 CPD'!K$2)=0,\"\",SUMIFS('07 PDR'!$F$4:$F$5600,'07 PDR'!$A$4:$A$5600,'05 CPD'!$A44,'07 PDR'!$K$4:$K$5600,'05 CPD'!K$2))","v":""},{"$f":"IF(SUMIFS('07 PDR'!$F$4:$F$5600,'07 PDR'!$A$4:$A$5600,'05 CPD'!$A44,'07 PDR'!$K$4:$K$5600,'05 CPD'!L$2)=0,\"\",SUMIFS('07 PDR'!$F$4:$F$5600,'07 PDR'!$A$4:$A$5600,'05 CPD'!$A44,'07 PDR'!$K$4:$K$5600,'05 CPD'!L$2))","v":""},{"$f":"IF(SUMIFS('07 PDR'!$F$4:$F$5600,'07 PDR'!$A$4:$A$5600,'05 CPD'!$A44,'07 PDR'!$K$4:$K$5600,'05 CPD'!M$2)=0,\"\",SUMIFS('07 PDR'!$F$4:$F$5600,'07 PDR'!$A$4:$A$5600,'05 CPD'!$A44,'07 PDR'!$K$4:$K$5600,'05 CPD'!M$2))","v":""},{"$f":"IF(SUMIFS('07 PDR'!$F$4:$F$5600,'07 PDR'!$A$4:$A$5600,'05 CPD'!$A44,'07 PDR'!$K$4:$K$5600,'05 CPD'!N$2)=0,\"\",SUMIFS('07 PDR'!$F$4:$F$5600,'07 PDR'!$A$4:$A$5600,'05 CPD'!$A44,'07 PDR'!$K$4:$K$5600,'05 CPD'!N$2))","v":""},{"$f":"IF(SUMIFS('07 PDR'!$F$4:$F$5600,'07 PDR'!$A$4:$A$5600,'05 CPD'!$A44,'07 PDR'!$K$4:$K$5600,'05 CPD'!O$2)=0,\"\",SUMIFS('07 PDR'!$F$4:$F$5600,'07 PDR'!$A$4:$A$5600,'05 CPD'!$A44,'07 PDR'!$K$4:$K$5600,'05 CPD'!O$2))","v":""},{"$f":"IF(SUMIFS('07 PDR'!$F$4:$F$5600,'07 PDR'!$A$4:$A$5600,'05 CPD'!$A44,'07 PDR'!$K$4:$K$5600,'05 CPD'!P$2)=0,\"\",SUMIFS('07 PDR'!$F$4:$F$5600,'07 PDR'!$A$4:$A$5600,'05 CPD'!$A44,'07 PDR'!$K$4:$K$5600,'05 CPD'!P$2))","v":""},{"$f":"IF(SUMIFS('07 PDR'!$F$4:$F$5600,'07 PDR'!$A$4:$A$5600,'05 CPD'!$A44,'07 PDR'!$K$4:$K$5600,'05 CPD'!Q$2)=0,\"\",SUMIFS('07 PDR'!$F$4:$F$5600,'07 PDR'!$A$4:$A$5600,'05 CPD'!$A44,'07 PDR'!$K$4:$K$5600,'05 CPD'!Q$2))","v":""},{"$f":"IF(SUMIFS('07 PDR'!$F$4:$F$5600,'07 PDR'!$A$4:$A$5600,'05 CPD'!$A44,'07 PDR'!$K$4:$K$5600,'05 CPD'!R$2)=0,\"\",SUMIFS('07 PDR'!$F$4:$F$5600,'07 PDR'!$A$4:$A$5600,'05 CPD'!$A44,'07 PDR'!$K$4:$K$5600,'05 CPD'!R$2))","v":""},null,{"$f":"IF(SUMIFS('07 PDR'!$F$4:$F$5600,'07 PDR'!$A$4:$A$5600,'05 CPD'!$A44,'07 PDR'!$L$4:$L$5600,'05 CPD'!T$2)=0,\"\",SUMIFS('07 PDR'!$F$4:$F$5600,'07 PDR'!$A$4:$A$5600,'05 CPD'!$A44,'07 PDR'!$L$4:$L$5600,'05 CPD'!T$2))","v":""},{"$f":"IF(SUMIFS('07 PDR'!$F$4:$F$5600,'07 PDR'!$A$4:$A$5600,'05 CPD'!$A44,'07 PDR'!$L$4:$L$5600,'05 CPD'!U$2)=0,\"\",SUMIFS('07 PDR'!$F$4:$F$5600,'07 PDR'!$A$4:$A$5600,'05 CPD'!$A44,'07 PDR'!$L$4:$L$5600,'05 CPD'!U$2))","v":""},{"$f":"IF(SUMIFS('07 PDR'!$F$4:$F$5600,'07 PDR'!$A$4:$A$5600,'05 CPD'!$A44,'07 PDR'!$L$4:$L$5600,'05 CPD'!V$2)=0,\"\",SUMIFS('07 PDR'!$F$4:$F$5600,'07 PDR'!$A$4:$A$5600,'05 CPD'!$A44,'07 PDR'!$L$4:$L$5600,'05 CPD'!V$2))","v":""},{"$f":"IF(SUMIFS('07 PDR'!$F$4:$F$5600,'07 PDR'!$A$4:$A$5600,'05 CPD'!$A44,'07 PDR'!$L$4:$L$5600,'05 CPD'!W$2)=0,\"\",SUMIFS('07 PDR'!$F$4:$F$5600,'07 PDR'!$A$4:$A$5600,'05 CPD'!$A44,'07 PDR'!$L$4:$L$5600,'05 CPD'!W$2))","v":""},{"$f":"IF(SUMIFS('07 PDR'!$F$4:$F$5600,'07 PDR'!$A$4:$A$5600,'05 CPD'!$A44,'07 PDR'!$L$4:$L$5600,'05 CPD'!X$2)=0,\"\",SUMIFS('07 PDR'!$F$4:$F$5600,'07 PDR'!$A$4:$A$5600,'05 CPD'!$A44,'07 PDR'!$L$4:$L$5600,'05 CPD'!X$2))","v":""},{"$f":"IF(SUMIFS('07 PDR'!$F$4:$F$5600,'07 PDR'!$A$4:$A$5600,'05 CPD'!$A44,'07 PDR'!$L$4:$L$5600,'05 CPD'!Y$2)=0,\"\",SUMIFS('07 PDR'!$F$4:$F$5600,'07 PDR'!$A$4:$A$5600,'05 CPD'!$A44,'07 PDR'!$L$4:$L$5600,'05 CPD'!Y$2))","v":""},{"$f":"IF(SUMIFS('07 PDR'!$F$4:$F$5600,'07 PDR'!$A$4:$A$5600,'05 CPD'!$A44,'07 PDR'!$L$4:$L$5600,'05 CPD'!Z$2)=0,\"\",SUMIFS('07 PDR'!$F$4:$F$5600,'07 PDR'!$A$4:$A$5600,'05 CPD'!$A44,'07 PDR'!$L$4:$L$5600,'05 CPD'!Z$2))","v":""},{"$f":"IF(SUMIFS('07 PDR'!$F$4:$F$5600,'07 PDR'!$A$4:$A$5600,'05 CPD'!$A44,'07 PDR'!$L$4:$L$5600,'05 CPD'!AA$2)=0,\"\",SUMIFS('07 PDR'!$F$4:$F$5600,'07 PDR'!$A$4:$A$5600,'05 CPD'!$A44,'07 PDR'!$L$4:$L$5600,'05 CPD'!AA$2))","v":""},{"$f":"IF(SUMIFS('07 PDR'!$F$4:$F$5600,'07 PDR'!$A$4:$A$5600,'05 CPD'!$A44,'07 PDR'!$L$4:$L$5600,'05 CPD'!AB$2)=0,\"\",SUMIFS('07 PDR'!$F$4:$F$5600,'07 PDR'!$A$4:$A$5600,'05 CPD'!$A44,'07 PDR'!$L$4:$L$5600,'05 CPD'!AB$2))","v":""},{"$f":"IF(SUMIFS('07 PDR'!$F$4:$F$5600,'07 PDR'!$A$4:$A$5600,'05 CPD'!$A44,'07 PDR'!$L$4:$L$5600,'05 CPD'!AC$2)=0,\"\",SUMIFS('07 PDR'!$F$4:$F$5600,'07 PDR'!$A$4:$A$5600,'05 CPD'!$A44,'07 PDR'!$L$4:$L$5600,'05 CPD'!AC$2))","v":""},{"$f":"IF(SUMIFS('07 PDR'!$F$4:$F$5600,'07 PDR'!$A$4:$A$5600,'05 CPD'!$A44,'07 PDR'!$L$4:$L$5600,'05 CPD'!AD$2)=0,\"\",SUMIFS('07 PDR'!$F$4:$F$5600,'07 PDR'!$A$4:$A$5600,'05 CPD'!$A44,'07 PDR'!$L$4:$L$5600,'05 CPD'!AD$2))","v":""},{"$f":"IF(SUMIFS('07 PDR'!$F$4:$F$5600,'07 PDR'!$A$4:$A$5600,'05 CPD'!$A44,'07 PDR'!$L$4:$L$5600,'05 CPD'!AE$2)=0,\"\",SUMIFS('07 PDR'!$F$4:$F$5600,'07 PDR'!$A$4:$A$5600,'05 CPD'!$A44,'07 PDR'!$L$4:$L$5600,'05 CPD'!AE$2))","v":""},{"$f":"IF(SUMIFS('07 PDR'!$F$4:$F$5600,'07 PDR'!$A$4:$A$5600,'05 CPD'!$A44,'07 PDR'!$L$4:$L$5600,'05 CPD'!AF$2)=0,\"\",SUMIFS('07 PDR'!$F$4:$F$5600,'07 PDR'!$A$4:$A$5600,'05 CPD'!$A44,'07 PDR'!$L$4:$L$5600,'05 CPD'!AF$2))","v":""}]
["TOTAL:",null,null,{"$f":"IF(SUM(B3:B43)=0,\"-\",SUM(B3:B43))","v":"-"},"Cumulative \nCPD Hours",null,"TOTAL:",{"$f":"IF(SUM(H3:H43)=0,\"-\",SUM(H3:H43))","v":"-"},{"$f":"IF(SUM(I3:I43)=0,\"-\",SUM(I3:I43))","v":"-"},"-","-","-","-","-","-","-","-","-","TOTAL:",{"$f":"IF(SUM(T3:T43)=0,\"-\",SUM(T3:T43))","v":"-"},{"$f":"IF(SUM(U3:U43)=0,\"-\",SUM(U3:U43))","v":"-"},"-","-","-","-","-","-","-","-","-","-","-"]

{"sheet":"06 DAP","index":2,"n_rows":550,"n_cols":12,"rows_kept":550,"cut":false,"hidden":false,"merged":[[1,8,1,11],[1,3,1,7],[1,0,1,2],[0,0,0,9]]}
["DEVELOPMENT ACTION PLAN",null,null,null,null,null,null,null,null,null,"LAST UPDATED:"]
[null,null,null,"REVIEW OF LEARNING NEEDS",null,null,null,null,"DEVELOPMENT PLAN"]
["Annual\nPeriod","Date \nfrom","Date \nto","Development Action Plan Ref","Title","In what area do I need to improve my performance?","How does this link to other objectives (E.g. employer, ICE, etc.)?","What do I need to learn in order to achieve this?","What will I do to achieve this?","What are the likely resources and support that I will need?","How will I evaluate a successful outcome?","What are my deadlines for meeting this target?"]
[null,null,null,1]
[null,null,null,2]
[null,null,null,3]
[null,null,null,4]
[null,null,null,5]
[null,null,null,6]
[null,null,null,7]
[null,null,null,8]
[null,null,null,9]
[null,null,null,10]
[null,null,null,11]
[null,null,null,12]
[null,null,null,13]
[null,null,null,14]
[null,null,null,15]
[null,null,null,16]
[null,null,null,17]
[null,null,null,18]
[null,null,null,19]
[null,null,null,20]
[null,null,null,21]
[null,null,null,22]
[null,null,null,23]
[null,null,null,24]
[null,null,null,25]
[null,null,null,26]
[null,null,null,27]
[null,null,null,28]
[null,null,null,29]
[null,null,null,30]
[null,null,null,31]
[null,null,null,32]
[null,null,null,33]
[null,null,null,34]
[null,null,null,35]
[null,null,null,36]
[null,null,null,37]
[null,null,null,38]
[null,null,null,39]
[null,null,null,40]
[null,null,null,41]
[null,null,null,42]
[null,null,null,43]
[null,null,null,44]
[null,null,null,45]
[null,null,null,46]
[null,null,null,47]
[null,null,null,48]
[null,null,null,49]
[null,null,null,50]
[null,null,null,51]
[null,null,null,52]
[null,null,null,53]
[null,null,null,54]
[null,null,null,55]
[null,null,null,56]
[null,null,null,57]
[null,null,null,58]
[null,null,null,59]
[null,null,null,60]
[null,null,null,61]
[null,null,null,62]
[null,null,null,63]
[null,null,null,64]
[null,null,null,65]
[null,null,null,66]
[null,null,null,67]
[null,null,null,68]
[null,null,null,69]
[null,null,null,70]
[null,null,null,71]
[null,null,null,72]
[null,null,null,73]
[null,null,null,74]
[null,null,null,75]
[null,null,null,76]
[null,null,null,77]
[null,null,null,78]
[null,null,null,79]
[null,null,null,80]
[null,null,null,81]
[null,null,null,82]
[null,null,null,83]
[null,null,null,84]
[null,null,null,85]
[null,null,null,86]
[null,null,null,87]
[null,null,null,88]
[null,null,null,89]
[null,null,null,90]
[null,null,null,91]
[null,null,null,92]
[null,null,null,93]
[null,null,null,94]
[null,null,null,95]
[null,null,null,96]
[null,null,null,97]
[null,null,null,98]
[null,null,null,99]
[null,null,null,100]
[null,null,null,101]
[null,null,null,102]
[null,null,null,103]
[null,null,null,104]
[null,null,null,105]
[null,null,null,106]
[null,null,null,107]
[null,null,null,108]
[null,null,null,109]
[null,null,null,110]
[null,null,null,111]
[null,null,null,112]
[null,null,null,113]
[null,null,null,114]
[null,null,null,115]
[null,null,null,116]
[null,null,null,117]
[null,null,null,118]
[null,null,null,119]
[null,null,null,120]
[null,null,null,121]
[null,null,null,122]
[null,null,null,123]
[null,null,null,124]
[null,null,null,125]
[null,null,null,126]
[null,null,null,127]
[null,null,null,128]
[null,null,null,129]
[null,null,null,130]
[null,null,null,131]
[null,null,null,132]
[null,null,null,133]
[null,null,null,134]
[null,null,null,135]
[null,null,null,136]
[null,null,null,137]
[null,null,null,138]
[null,null,null,139]
[null,null,null,140]
[null,null,null,141]
[null,null,null,142]
[null,null,null,143]
[null,null,null,144]
[null,null,null,145]
[null,null,null,146]
[null,null,null,147]
[null,null,null,148]
[null,null,null,149]
[null,null,null,150]
[null,null,null,151]
[null,null,null,152]
[null,null,null,153]
[null,null,null,154]
[null,null,null,155]
[null,null,null,156]
[null,null,null,157]
[null,null,null,158]
[null,null,null,159]
[null,null,null,160]
[null,null,null,161]
[null,null,null,162]
[null,null,null,163]
[null,null,null,164]
[null,null,null,165]
[null,null,null,166]
[null,null,null,167]
[null,null,null,168]
[null,null,null,169]
[null,null,null,170]
[null,null,null,171]
[null,null,null,172]
[null,null,null,173]
[null,null,null,174]
[null,null,null,175]
[null,null,null,176]
[null,null,null,177]
[null,null,null,178]
[null,null,null,179]
[null,null,null,180]
[null,null,null,181]
[null,null,null,182]
[null,null,null,183]
[null,null,null,184]
[null,null,null,185]
[null,null,null,186]
[null,null,null,187]
[null,null,null,188]
[null,null,null,189]
[null,null,null,190]
[null,null,null,191]
[null,null,null,192]
[null,null,null,193]
[null,null,null,194]
[null,null,null,195]
[null,null,null,196]
[null,null,null,197]
[null,null,null,198]
[null,null,null,199]
[null,null,null,200]
[null,null,null,201]
[null,null,null,202]
[null,null,null,203]
[null,null,null,204]
[null,null,null,205]
[null,null,null,206]
[null,null,null,207]
[null,null,null,208]
[null,null,null,209]
[null,null,null,210]
[null,null,null,211]
[null,null,null,212]
[null,null,null,213]
[null,null,null,214]
[null,null,null,215]
[null,null,null,216]
[null,null,null,217]
[null,null,null,218]
[null,null,null,219]
[null,null,null,220]
[null,null,null,221]
[null,null,null,222]
[null,null,null,223]
[null,null,null,224]
[null,null,null,225]
[null,null,null,226]
[null,null,null,227]
[null,null,null,228]
[null,null,null,229]
[null,null,null,230]
[null,null,null,231]
[null,null,null,232]
[null,null,null,233]
[null,null,null,234]
[null,null,null,235]
[null,null,null,236]
[null,null,null,237]
[null,null,null,238]
[null,null,null,239]
[null,null,null,240]
[null,null,null,241]
[null,null,null,242]
[null,null,null,243]
[null,null,null,244]
[null,null,null,245]
[null,null,null,246]
[null,null,null,247]
[null,null,null,248]
[null,null,null,249]
[null,null,null,250]
[null,null,null,251]
[null,null,null,252]
[null,null,null,253]
[null,null,null,254]
[null,null,null,255]
[null,null,null,256]
[null,null,null,257]
[null,null,null,258]
[null,null,null,259]
[null,null,null,260]
[null,null,null,261]
[null,null,null,262]
[null,null,null,263]
[null,null,null,264]
[null,null,null,265]
[null,null,null,266]
[null,null,null,267]
[null,null,null,268]
[null,null,null,269]
[null,null,null,270]
[null,null,null,271]
[null,null,null,272]
[null,null,null,273]
[null,null,null,274]
[null,null,null,275]
[null,null,null,276]
[null,null,null,277]
[null,null,null,278]
[null,null,null,279]
[null,null,null,280]
[null,null,null,281]
[null,null,null,282]
[null,null,null,283]
[null,null,null,284]
[null,null,null,285]
[null,null,null,286]
[null,null,null,287]
[null,null,null,288]
[null,null,null,289]
[null,null,null,290]
[null,null,null,291]
[null,null,null,292]
[null,null,null,293]
[null,null,null,294]
[null,null,null,295]
[null,null,null,296]
[null,null,null,297]
[null,null,null,298]
[null,null,null,299]
[null,null,null,300]
[null,null,null,301]
[null,null,null,302]
[null,null,null,303]
[null,null,null,304]
[null,null,null,305]
[null,null,null,306]
[null,null,null,307]
[null,null,null,308]
[null,null,null,309]
[null,null,null,310]
[null,null,null,311]
[null,null,null,312]
[null,null,null,313]
[null,null,null,314]
[null,null,null,315]
[null,null,null,316]
[null,null,null,317]
[null,null,null,318]
[null,null,null,319]
[null,null,null,320]
[null,null,null,321]
[null,null,null,322]
[null,null,null,323]
[null,null,null,324]
[null,null,null,325]
[null,null,null,326]
[null,null,null,327]
[null,null,null,328]
[null,null,null,329]
[null,null,null,330]
[null,null,null,331]
[null,null,null,332]
[null,null,null,333]
[null,null,null,334]
[null,null,null,335]
[null,null,null,336]
[null,null,null,337]
[null,null,null,338]
[null,null,null,339]
[null,null,null,340]
[null,null,null,341]
[null,null,null,342]
[null,null,null,343]
[null,null,null,344]
[null,null,null,345]
[null,null,null,346]
[null,null,null,347]
[null,null,null,348]
[null,null,null,349]
[null,null,null,350]
[null,null,null,351]
[null,null,null,352]
[null,null,null,353]
[null,null,null,354]
[null,null,null,355]
[null,null,null,356]
[null,null,null,357]
[null,null,null,358]
[null,null,null,359]
[null,null,null,360]
[null,null,null,361]
[null,null,null,362]
[null,null,null,363]
[null,null,null,364]
[null,null,null,365]
[null,null,null,366]
[null,null,null,367]
[null,null,null,368]
[null,null,null,369]
[null,null,null,370]
[null,null,null,371]
[null,null,null,372]
[null,null,null,373]
[null,null,null,374]
[null,null,null,375]
[null,null,null,376]
[null,null,null,377]
[null,null,null,378]
[null,null,null,379]
[null,null,null,380]
[null,null,null,381]
[null,null,null,382]
[null,null,null,383]
[null,null,null,384]
[null,null,null,385]
[null,null,null,386]
[null,null,null,387]
[null,null,null,388]
[null,null,null,389]
[null,null,null,390]
[null,null,null,391]
[null,null,null,392]
[null,null,null,393]
[null,null,null,394]
[null,null,null,395]
[null,null,null,396]
[null,null,null,397]
[null,null,null,398]
[null,null,null,399]
[null,null,null,400]
[null,null,null,401]
[null,null,null,402]
[null,null,null,403]
[null,null,null,404]
[null,null,null,405]
[null,null,null,406]
[null,null,null,407]
[null,null,null,408]
[null,null,null,409]
[null,null,null,410]
[null,null,null,411]
[null,null,null,412]
[null,null,null,413]
[null,null,null,414]
[null,null,null,415]
[null,null,null,416]
[null,null,null,417]
[null,null,null,418]
[null,null,null,419]
[null,null,null,420]
[null,null,null,421]
[null,null,null,422]
[null,null,null,423]
[null,null,null,424]
[null,null,null,425]
[null,null,null,426]
[null,null,null,427]
[null,null,null,428]
[null,null,null,429]
[null,null,null,430]
[null,null,null,431]
[null,null,null,432]
[null,null,null,433]
[null,null,null,434]
[null,null,null,435]
[null,null,null,436]
[null,null,null,437]
[null,null,null,438]
[null,null,null,439]
[null,null,null,440]
[null,null,null,441]
[null,null,null,442]
[null,null,null,443]
[null,null,null,444]
[null,null,null,445]
[null,null,null,446]
[null,null,null,447]
[null,null,null,448]
[null,null,null,449]
[null,null,null,450]
[null,null,null,451]
[null,null,null,452]
[null,null,null,453]
[null,null,null,454]
[null,null,null,455]
[null,null,null,456]
[null,null,null,457]
[null,null,null,458]
[null,null,null,459]
[null,null,null,460]
[null,null,null,461]
[null,null,null,462]
[null,null,null,463]
[null,null,null,464]
[null,null,null,465]
[null,null,null,466]
[null,null,null,467]
[null,null,null,468]
[null,null,null,469]
[null,null,null,470]
[null,null,null,471]
[null,null,null,472]
[null,null,null,473]
[null,null,null,474]
[null,null,null,475]
[null,null,null,476]
[null,null,null,477]
[null,null,null,478]
[null,null,null,479]
[null,null,null,480]
[null,null,null,481]
[null,null,null,482]
[null,null,null,483]
[null,null,null,484]
[null,null,null,485]
[null,null,null,486]
[null,null,null,487]
[null,null,null,488]
[null,null,null,489]
[null,null,null,490]
[null,null,null,491]
[null,null,null,492]
[null,null,null,493]
[null,null,null,494]
[null,null,null,495]
[null,null,null,496]
[null,null,null,497]
[null,null,null,498]
[null,null,null,499]
[null,null,null,500]
[null,null,null,501]
[]
[]
[]
[]
[{"$f":"'05 CPD'!A2","v":"Annual Period"}]
[{"$f":"IF('05 CPD'!A3=\"\",\"-\",'05 CPD'!A3)","v":"Sept 2007 - Aug 2008"}]
[{"$f":"IF('05 CPD'!A4=\"\",\"-\",'05 CPD'!A4)","v":"Sept 2008 - Aug 2009"}]
[{"$f":"IF('05 CPD'!A5=\"\",\"-\",'05 CPD'!A5)","v":"Sept 2009 - Aug 2010"}]
[{"$f":"IF('05 CPD'!A6=\"\",\"-\",'05 CPD'!A6)","v":"Sept 2010 - Aug 2011"}]
[{"$f":"IF('05 CPD'!A7=\"\",\"-\",'05 CPD'!A7)","v":"Sept 2011 - Aug 2012"}]
[{"$f":"IF('05 CPD'!A8=\"\",\"-\",'05 CPD'!A8)","v":"Sept 2012 - Aug 2013"}]
[{"$f":"IF('05 CPD'!A9=\"\",\"-\",'05 CPD'!A9)","v":"Sept 2013 - Dec 2014"}]
[{"$f":"IF('05 CPD'!A10=\"\",\"-\",'05 CPD'!A10)","v":"Jan 2015 - Aug 2015"}]
[{"$f":"IF('05 CPD'!A11=\"\",\"-\",'05 CPD'!A11)","v":"Sept 2015 - Aug 2016"}]
[{"$f":"IF('05 CPD'!A12=\"\",\"-\",'05 CPD'!A12)","v":"Sept 2016 - Aug 2017"}]
[{"$f":"IF('05 CPD'!A13=\"\",\"-\",'05 CPD'!A13)","v":"Sept 2017 - Aug 2018"}]
[{"$f":"IF('05 CPD'!A14=\"\",\"-\",'05 CPD'!A14)","v":"Sept 2018 - Aug 2019"}]
[{"$f":"IF('05 CPD'!A15=\"\",\"-\",'05 CPD'!A15)","v":"Sept 2019 - Aug 2020"}]
[{"$f":"IF('05 CPD'!A16=\"\",\"-\",'05 CPD'!A16)","v":"<Insert Period Range for Period 15>"}]
[{"$f":"IF('05 CPD'!A17=\"\",\"-\",'05 CPD'!A17)","v":"<Insert Period Range for Period 15>"}]
[{"$f":"IF('05 CPD'!A18=\"\",\"-\",'05 CPD'!A18)","v":"<Insert Period Range for Period 16>"}]
[{"$f":"IF('05 CPD'!A19=\"\",\"-\",'05 CPD'!A19)","v":"<Insert Period Range for Period 17>"}]
[{"$f":"IF('05 CPD'!A20=\"\",\"-\",'05 CPD'!A20)","v":"<Insert Period Range for Period 18>"}]
[{"$f":"IF('05 CPD'!A21=\"\",\"-\",'05 CPD'!A21)","v":"<Insert Period Range for Period 19>"}]
[{"$f":"IF('05 CPD'!A22=\"\",\"-\",'05 CPD'!A22)","v":"<Insert Period Range for Period 20>"}]
[{"$f":"IF('05 CPD'!A23=\"\",\"-\",'05 CPD'!A23)","v":"<Insert Period Range for Period 21>"}]
[{"$f":"IF('05 CPD'!A24=\"\",\"-\",'05 CPD'!A24)","v":"<Insert Period Range for Period 22>"}]
[{"$f":"IF('05 CPD'!A25=\"\",\"-\",'05 CPD'!A25)","v":"<Insert Period Range for Period 23>"}]
[{"$f":"IF('05 CPD'!A26=\"\",\"-\",'05 CPD'!A26)","v":"<Insert Period Range for Period 24>"}]
[{"$f":"IF('05 CPD'!A27=\"\",\"-\",'05 CPD'!A27)","v":"<Insert Period Range for Period 25>"}]
[{"$f":"IF('05 CPD'!A42=\"\",\"-\",'05 CPD'!A42)","v":"<Insert Period Range for Period 40>"}]
[{"$f":"IF('05 CPD'!A43=\"\",\"-\",'05 CPD'!A43)","v":"<Insert Period Range for Period 41>"}]
[{"$f":"IF('05 CPD'!A44=\"\",\"-\",'05 CPD'!A44)","v":"<Insert Period Range for Period 42>"}]
[{"$f":"IF('05 CPD'!A46=\"\",\"-\",'05 CPD'!A46)","v":"-"}]
[{"$f":"IF('05 CPD'!A47=\"\",\"-\",'05 CPD'!A47)","v":"-"}]
[{"$f":"IF('05 CPD'!A48=\"\",\"-\",'05 CPD'!A48)","v":"-"}]
[{"$f":"IF('05 CPD'!A49=\"\",\"-\",'05 CPD'!A49)","v":"-"}]
[{"$f":"IF('05 CPD'!A50=\"\",\"-\",'05 CPD'!A50)","v":"-"}]
[{"$f":"IF('05 CPD'!A51=\"\",\"-\",'05 CPD'!A51)","v":"-"}]
[{"$f":"IF('05 CPD'!A52=\"\",\"-\",'05 CPD'!A52)","v":"-"}]
[{"$f":"IF('05 CPD'!A53=\"\",\"-\",'05 CPD'!A53)","v":"-"}]
[{"$f":"IF('05 CPD'!A54=\"\",\"-\",'05 CPD'!A54)","v":"-"}]
[{"$f":"IF('05 CPD'!A55=\"\",\"-\",'05 CPD'!A55)","v":"-"}]
[{"$f":"IF('05 CPD'!A56=\"\",\"-\",'05 CPD'!A56)","v":"-"}]
[{"$f":"IF('05 CPD'!A57=\"\",\"-\",'05 CPD'!A57)","v":"-"}]
[{"$f":"IF('05 CPD'!A58=\"\",\"-\",'05 CPD'!A58)","v":"-"}]

{"sheet":"07 PDR","index":3,"n_rows":7006,"n_cols":14,"rows_kept":7006,"cut":false,"hidden":false,"merged":[[1,7,1,9],[1,0,1,6],[0,0,0,11]]}
["PERSONAL DEVELOPMENT RECORDS"]
["DEVELOPMENT ACTIVITY",null,null,null,null,null,null,"EVALUATION",null,null,"LAST UPDATED:"]
["Annual\nPeriod","Activity Name","Details of CPD activity","Date\nFrom:","Date\nTo:","Effective learning time\n(Hours)",{"$f":"'06 DAP'!D3","v":"Development Action Plan Ref"},"Key Learning Points","Key Benefits/Value added","Further comments: was the plan successful? How can I improve it in future?","Category","Sub-Category"]
[]
[]
[]
[]
[]
[]
[]
[]
[]
[]
[]
[]
[]
[]
[]
[]
[]
[]
[]
[]
[]
[]
[]
[]
[]
[]
[]
[]
[]
[]
[]
[]
[]
[]
[]
[]
[]
[]
[]
[]
[]
[]
[]
[]
[]
[]
[]
[]
[]
[]
[]
[]
[]
[]
[]
[]
[]
[]
[]
[]
[]
[]
[]
[]
[]
[]
[]
[]
[]
[]
[]
[]
[]
[]
[]
[]
[]
[]
[]
[]
[]
[]
[]
[]
[]
[]
[]
[]
[]
[]
[]
[]
[]
[]
[]
[]
[]
[]
[]
[]
[]
[]
[]
[]
[]
[]
[]
[]
[]
[]
[]
[]
[]
[]
[]
[]
[]
[]
[]
[]
[]
[]
[]
[]
[]
[]
[]
[]
[]
[]
[]
[]
[]
[]
[]
[]
[]
[]
[]
[]
[]
[]
[]
[]
[]
[]
[]
[]
[]
[]
[]
[]
[]
[]
[]
[]
[]
[]
[]
[]
[]
[]
[]
[]
[]
[]
[]
[]
[]
[]
[]
[]
[]
[]
[]
[]
[]
[]
[]
[]
[]
[]
[]
[]
[]
[]
[]
[]
[]
[]
[]
[]
[]
[]
[]
[]
[]
[]
[]
[]
[]
[]
[]
[]
[]
[]
[]
[]
[]
[]
[]
[]
[]
[]
[]
[]
[]
[]
[]
[]
[]
[]
[]
[]
[]
[]
[]
[]
[]
[]
[]
[]
[]
[]
[]
[]
[]
[]
[]
[]
[]
[]
[]
[]
[]
[]
[]
[]
[]
[]
[]
[]
[]
[]
[]
[]
[]
[]
[]
[]
[]
[]
[]
[]
[]
[]
[]
[]
[]
[]
[]
[]
[]
[]
[]
[]
[]
[]
[]
[]
[]
[]
[]
[]
[]
[]
[]
[]
[]
[]
[]
[]
[]
[]
[]
[]
[]
[]
[]
[]
[]
[]
[]
[]
[]
[]
[]
[]
[]
[]
[]
[]
[]
[]
[]
[]
[]
[]
[]
[]
[]
[]
[]
[]
[]
[]
[]
[]
[]
[]
[]
[]
[]
[]
[]
[]
[]
[]
[]
[]
[]
[]
[]
[]
[]
[]
[]
[]
[]
[]
[]
[]
[]
[]
[]
[]
[]
[]
[]
[]
[]
[]
[]
[]
[]
[]
[]
[]
[]
[]
[]
[]
[]
[]
[]
[]
[]
[]
[]
[]
[]
[]
[]
[]
[]
[]
[]
[]
[]
[]
[]
[]
[]
[]
[]
[]
[]
[]
[]
[]
[]
[]
[]
[]
[]
[]
[]
[]
[]
[]
[]
[]
[]
[]
[]
[]
[]
[]
[]
[]
[]
[]
[]
[]
[]
[]
[]
[]
[]
[]
[]
[]
[]
[]
[]
[]
[]
[]
[]
[]
[]
[]
[]
[]
[]
[]
[]
[]
[]
[]
[]
[]
[]
[]
[]
[]
[]
[]
[]
[]
[]
[]
[]
[]
[]
[]
[]
[]
[]
[]
[]
[]
[]
[]
[]
[]
[]
[]
[]
[]
[]
[]
[]
[]
[]
[]
[]
[]
[]
[]
[]
[]
[]
[]
[]
[]
[]
[]
[]
[]
[]
[]
[]
[]
[]
[]
[]
[]
[]
[]
[]
[]
[]
[]
[]
[]
[]
[]
[]
[]
[]
[]
[]
[]
[]
[]
[]
[]
[]
[]
[]
[]
[]
[]
[]
[]
[]
[]
[]
[]
[]
[]
[]
[]
[]
[]
[]
[]
[]
[]
[]
[]
[]
[]
[]
[]
[]
[]
[]
[]
[]
[]
[]
[]
[]
[]
[]
[]
[]
[]
[]
[]
[]
[]
[]
[]
[]
[]
[]
[]
[]
[]
[]
[]
[]
[]
[]
[]
[]
[]
[]
[]
[]
[]
[]
[]
[]
[]
[]
[]
[]
[]
[]
[]
[]
[]
[]
[]
[]
[]
[]
[]
[]
[]
[]
[]
[]
[]
[]
[]
[]
[]
[]
[]
[]
[]
[]
[]
[]
[]
[]
[]
[]
[]
[]
[]
[]
[]
[]
[]
[]
[]
[]
[]
[]
[]
[]
[]
[]
[]
[]
[]
[]
[]
[]
[]
[]
[]
[]
[]
[]
[]
[]
[]
[]
[]
[]
[]
[]
[]
[]
[]
[]
[]
[]
[]
[]
[]
[]
[]
[]
[]
[]
[]
[]
[]
[]
[]
[]
[]
[]
[]
[]
[]
[]
[]
[]
[]
[]
[]
[]
[]
[]
[]
[]
[]
[]
[]
[]
[]
[]
[]
[]
[]
[]
[]
[]
[]
[]
[]
[]
[]
[]
[]
[]
[]
[]
[]
[]
[]
[]
[]
[]
[]
[]
[]
[]
[]
[]
[]
[]
[]
[]
[]
[]
[]
[]
[]
[]
[]
[]
[]
[]
[]
[]
[]
[]
[]
[]
[]
[]
[]
[]
[]
[]
[]
[]
[]
[]
[]
[]
[]
[]
[]
[]
[]
[]
[]
[]
[]
[]
[]
[]
[]
[]
[]
[]
[]
[]
[]
[]
[]
[]
[]
[]
[]
[]
[]
[]
[]
[]
[]
[]
[]
[]
[]
[]
[]
[]
[]
[]
[]
[]
[]
[]
[]
[]
[]
[]
[]
[]
[]
[]
[]
[]
[]
[]
[]
[]
[]
[]
[]
[]
[]
[]
[]
[]
[]
[]
[]
[]
[]
[]
[]
[]
[]
[]
[]
[]
[]
[]
[]
[]
[]
[]
[]
[]
[]
[]
[]
[]
[]
[]
[]
[]
[]
[]
[]
[]
[]
[]
[]
[]
[]
[]
[]
[]
[]
[]
[]
[]
[]
[]
[]
[]
[]
[]
[]
[]
[]
[]
[]
[]
[]
[]
[]
[]
[]
[]
[]
[]
[]
[]
[]
[]
[]
[]
[]
[]
[]
[]
[]
[]
[]
[]
[]
[]
[]
[]
[]
[]
[]
[]
[]
[]
[]
[]
[]
[]
[]
[]
[]
[]
[]
[]
[]
[]
[]
[]
[]
[]
[]
[]
[]
[]
[]
[]
[]
[]
[]
[]
[]
[]
[]
[]
[]
[]
[]
[]
[]
[]
[]
[]
[]
[]
[]
[]
[]
[]
[]
[]
[]
[]
[]
[]
[]
[]
[]
[]
[]
[]
[]
[]
[]
[]
[]
[]
[]
[]
[]
[]
[]
[]
[]
[]
[]
[]
[]
[]
[]
[]
[]
[]
[]
[]
[]
[]
[]
[]
[]
[]
[]
[]
[]
[]
[]
[]
[]
[]
[]
[]
[]
[]
[]
[]
[]
[]
[]
[]
[]
[]
[]
[]
[]
[]
[]
[]
[]
[]
[]
[]
[]
[]
[]
[]
[]
[]
[]
[]
[]
[]
[]
[]
[]
[]
[]
[]
[]
[]
[]
[]
[]
[]
[]
[]
[]
[]
[]
[]
[]
[]
[]
[]
[]
[]
[]
[]
[]
[]
[]
[]
[]
[]
[]
[]
[]
[]
[]
[]
[]
[]
[]
[]
[]
[]
[]
[]
[]
[]
[]
[]
[]
[]
[]
[]
[]
[]
[]
[]
[]
[]
[]
[]
[]
[]
[]
[]
[]
[]
[]
[]
[]
[]
[]
[]
[]
[]
[]
[]
[]
[]
[]
[]
[]
[]
[]
[]
[]
[]
[]
[]
[]
[]
[]
[]
[]
[]
[]
[]
[]
[]
[]
[]
[]
[]
[]
[]
[]
[]
[]
[]
[]
[]
[]
[]
[]
[]
[]
[]
[]
[]
[]
[]
[]
[]
[]
[]
[]
[]
[]
[]
[]
[]
[]
[]
[]
[]
[]
[]
[]
[]
[]
[]
[]
[]
[]
[]
[]
[]
[]
[]
[]
[]
[]
[]
[]
[]
[]
[]
[]
[]
[]
[]
[]
[]
[]
[]
[]
[]
[]
[]
[]
[]
[]
[]
[]
[]
[]
[]
[]
[]
[]
[]
[]
[]
[]
[]
[]
[]
[]
[]
[]
[]
[]
[]
[]
[]
[]
[]
[]
[]
[]
[]
[]
[]
[]
[]
[]
[]
[]
[]
[]
[]
[]
[]
[]
[]
[]
[]
[]
[]
[]
[]
[]
[]
[]
[]
[]
[]
[]
[]
[]
[]
[]
[]
[]
[]
[]
[]
[]
[]
[]
[]
[]
[]
[]
[]
[]
[]
[]
[]
[]
[]
[]
[]
[]
[]
[]
[]
[]
[]
[]
[]
[]
[]
[]
[]
[]
[]
[]
[]
[]
[]
[]
[]
[]
[]
[]
[]
[]
[]
[]
[]
[]
[]
[]
[]
[]
[]
[]
[]
[]
[]
[]
[]
[]
[]
[]
[]
[]
[]
[]
[]
[]
[]
[]
[]
[]
[]
[]
[]
[]
[]
[]
[]
[]
[]
[]
[]
[]
[]
[]
[]
[]
[]
[]
[]
[]
[]
[]
[]
[]
[]
[]
[]
[]
[]
[]
[]
[]
[]
[]
[]
[]
[]
[]
[]
[]
[]
[]
[]
[]
[]
[]
[]
[]
[]
[]
[]
[]
[]
[]
[]
[]
[]
[]
[]
[]
[]
[]
[]
[]
[]
[]
[]
[]
[]
[]
[]
[]
[]
[]
[]
[]
[]
[]
[]
[]
[]
[]
[]
[]
[]
[]
[]
[]
[]
[]
[]
[]
[]
[]
[]
[]
[]
[]
[]
[]
[]
[]
[]
[]
[]
[]
[]
[]
[]
[]
[]
[]
[]
[]
[]
[]
[]
[]
[]
[]
[]
[]
[]
[]
[]
[]
[]
[]
[]
[]
[]
[]
[]
[]
[]
[]
[]
[]
[]
[]
[]
[]
[]
[]
[]
[]
[]
[]
[]
[]
[]
[]
[]
[]
[]
[]
[]
[]
[]
[]
[]
[]
[]
[]
[]
[]
[]
[]
[]
[]
[]
[]
[]
[]
[]
[]
[]
[]
[]
[]
[]
[]
[]
[]
[]
[]
[]
[]
[]
[]
[]
[]
[]
[]
[]
[]
[]
[]
[]
[]
[]
[]
[]
[]
[]
[]
[]
[]
[]
[]
[]
[]
[]
[]
[]
[]
[]
[]
[]
[]
[]
[]
[]
[]
[]
[]
[]
[]
[]
[]
[]
[]
[]
[]
[]
[]
[]
[]
[]
[]
[]
[]
[]
[]
[]
[]
[]
[]
[]
[]
[]
[]
[]
[]
[]
[]
[]
[]
[]
[]
[]
[]
[]
[]
[]
[]
[]
[]
[]
[]
[]
[]
[]
[]
[]
[]
[]
[]
[]
[]
[]
[]
[]
[]
[]
[]
[]
[]
[]
[]
[]
[]
[]
[]
[]
[]
[]
[]
[]
[]
[]
[]
[]
[]
[]
[]
[]
[]
[]
[]
[]
[]
[]
[]
[]
[]
[]
[]
[]
[]
[]
[]
[]
[]
[]
[]
[]
[]
[]
[]
[]
[]
[]
[]
[]
[]
[]
[]
[]
[]
[]
[]
[]
[]
[]
[]
[]
[]
[]
[]
[]
[]
[]
[]
[]
[]
[]
[]
[]
[]
[]
[]
[]
[]
[]
[]
[]
[]
[]
[]
[]
[]
[]
[]
[]
[]
[]
[]
[]
[]
[]
[]
[]
[]
[]
[]
[]
[]
[]
[]
[]
[]
[]
[]
[]
[]
[]
[]
[]
[]
[]
[]
[]
[]
[]
[]
[]
[]
[]
[]
[]
[]
[]
[]
[]
[]
[]
[]
[]
[]
[]
[]
[]
[]
[]
[]
[]
[]
[]
[]
[]
[]
[]
[]
[]
[]
[]
[]
[]
[]
[]
[]
[]
[]
[]
[]
[]
[]
[]
[]
[]
[]
[]
[]
[]
[]
[]
[]
[]
[]
[]
[]
[]
[]
[]
[]
[]
[]
[]
[]
[]
[]
[]
[]
[]
[]
[]
[]
[]
[]
[]
[]
[]
[]
[]
[]
[]
[]
[]
[]
[]
[]
[]
[]
[]
[]
[]
[]
[]
[]
[]
[]
[]
[]
[]
[]
[]
[]
[]
[]
[]
[]
[]
[]
[]
[]
[]
[]
[]
[]
[]
[]
[]
[]
[]
[]
[]
[]
[]
[]
[]
[]
[]
[]
[]
[]
[]
[]
[]
[]
[]
[]
[]
[]
[]
[]
[]
[]
[]
[]
[]
[]
[]
[]
[]
[]
[]
[]
[]
[]
[]
[]
[]
[]
[]
[]
[]
[]
[]
[]
[]
[]
[]
[]
[]
[]
[]
[]
[]
[]
[]
[]
[]
[]
[]
[]
[]
[]
[]
[]
[]
[]
[]
[]
[]
[]
[]
[]
[]
[]
[]
[]
[]
[]
[]
[]
[]
[]
[]
[]
[]
[]
[]
[]
[]
[]
[]
[]
[]
[]
[]
[]
[]
[]
[]
[]
[]
[]
[]
[]
[]
[]
[]
[]
[]
[]
[]
[]
[]
[]
[]
[]
[]
[]
[]
[]
[]
[]
[]
[]
[]
[]
[]
[]
[]
[]
[]
[]
[]
[]
[]
[]
[]
[]
[]
[]
[]
[]
[]
[]
[]
[]
[]
[]
[]
[]
[]
[]
[]
[]
[]
[]
[]
[]
[]
[]
[]
[]
[]
[]
[]
[]
[]
[]
[]
[]
[]
[]
[]
[]
[]
[]
[]
[]
[]
[]
[]
[]
[]
[]
[]
[]
[]
[]
[]
[]
[]
[]
[]
[]
[]
[]
[]
[]
[]
[]
[]
[]
[]
[]
[]
[]
[]
[]
[]
[]
[]
[]
[]
[]
[]
[]
[]
[]
[]
[]
[]
[]
[]
[]
[]
[]
[]
[]
[]
[]
[]
[]
[]
[]
[]
[]
[]
[]
[]
[]
[]
[]
[]
[]
[]
[]
[]
[]
[]
[]
[]
[]
[]
[]
[]
[]
[]
[]
[]
[]
[]
[]
[]
[]
[]
[]
[]
[]
[]
[]
[]
[]
[]
[]
[]
[]
[]
[]
[]
[]
[]
[]
[]
[]
[]
[]
[]
[]
[]
[]
[]
[]
[]
[]
[]
[]
[]
[]
[]
[]
[]
[]
[]
[]
[]
[]
[]
[]
[]
[]
[]
[]
[]
[]
[]
[]
[]
[]
[]
[]
[]
[]
[]
[]
[]
[]
[]
[]
[]
[]
[]
[]
[]
[]
[]
[]
[]
[]
[]
[]
[]
[]
[]
[]
[]
[]
[]
[]
[]
[]
[]
[]
[]
[]
[]
[]
[]
[]
[]
[]
[]
[]
[]
[]
[]
[]
[]
[]
[]
[]
[]
[]
[]
[]
[]
[]
[]
[]
[]
[]
[]
[]
[]
[]
[]
[]
[]
[]
[]
[]
[]
[]
[]
[]
[]
[]
[]
[]
[]
[]
[]
[]
[]
[]
[]
[]
[]
[]
[]
[]
[]
[]
[]
[]
[]
[]
[]
[]
[]
[]
[]
[]
[]
[]
[]
[]
[]
[]
[]
[]
[]
[]
[]
[]
[]
[]
[]
[]
[]
[]
[]
[]
[]
[]
[]
[]
[]
[]
[]
[]
[]
[]
[]
[]
[]
[]
[]
[]
[]
[]
[]
[]
[]
[]
[]
[]
[]
[]
[]
[]
[]
[]
[]
[]
[]
[]
[]
[]
[]
[]
[]
[]
[]
[]
[]
[]
[]
[]
[]
[]
[]
[]
[]
[]
[]
[]
[]
[]
[]
[]
[]
[]
[]
[]
[]
[]
[]
[]
[]
[]
[]
[]
[]
[]
[]
[]
[]
[]
[]
[]
[]
[]
[]
[]
[]
[]
[]
[]
[]
[]
[]
[]
[]
[]
[]
[]
[]
[]
[]
[]
[]
[]
[]
[]
[]
[]
[]
[]
[]
[]
[]
[]
[]
[]
[]
[]
[]
[]
[]
[]
[]
[]
[]
[]
[]
[]
[]
[]
[]
[]
[]
[]
[]
[]
[]
[]
[]
[]
[]
[]
[]
[]
[]
[]
[]
[]
[]
[]
[]
[]
[]
[]
[]
[]
[]
[]
[]
[]
[]
[]
[]
[]
[]
[]
[]
[]
[]
[]
[]
[]
[]
[]
[]
[]
[]
[]
[]
[]
[]
[]
[]
[]
[]
[]
[]
[]
[]
[]
[]
[]
[]
[]
[]
[]
[]
[]
[]
[]
[]
[]
[]
[]
[]
[]
[]
[]
[]
[]
[]
[]
[]
[]
[]
[]
[]
[]
[]
[]
[]
[]
[]
[]
[]
[]
[]
[]
[]
[]
[]
[]
[]
[]
[]
[]
[]
[]
[]
[]
[]
[]
[]
[]
[]
[]
[]
[]
[]
[]
[]
[]
[]
[]
[]
[]
[]
[]
[]
[]
[]
[]
[]
[]
[]
[]
[]
[]
[]
[]
[]
[]
[]
[]
[]
[]
[]
[]
[]
[]
[]
[]
[]
[]
[]
[]
[]
[]
[]
[]
[]
[]
[]
[]
[]
[]
[]
[]
[]
[]
[]
[]
[]
[]
[]
[]
[]
[]
[]
[]
[]
[]
[]
[]
[]
[]
[]
[]
[]
[]
[]
[]
[]
[]
[]
[]
[]
[]
[]
[]
[]
[]
[]
[]
[]
[]
[]
[]
[]
[]
[]
[]
[]
[]
[]
[]
[]
[]
[]
[]
[]
[]
[]
[]
[]
[]
[]
[]
[]
[]
[]
[]
[]
[]
[]
[]
[]
[]
[]
[]
[]
[]
[]
[]
[]
[]
[]
[]
[]
[]
[]
[]
[]
[]
[]
[]
[]
[]
[]
[]
[]
[]
[]
[]
[]
[]
[]
[]
[]
[]
[]
[]
[]
[]
[]
[]
[]
[]
[]
[]
[]
[]
[]
[]
[]
[]
[]
[]
[]
[]
[]
[]
[]
[]
[]
[]
[]
[]
[]
[]
[]
[]
[]
[]
[]
[]
[]
[]
[]
[]
[]
[]
[]
[]
[]
[]
[]
[]
[]
[]
[]
[]
[]
[]
[]
[]
[]
[]
[]
[]
[]
[]
[]
[]
[]
[]
[]
[]
[]
[]
[]
[]
[]
[]
[]
[]
[]
[]
[]
[]
[]
[]
[]
[]
[]
[]
[]
[]
[]
[]
[]
[]
[]
[]
[]
[]
[]
[]
[]
[]
[]
[]
[]
[]
[]
[]
[]
[]
[]
[]
[]
[]
[]
[]
[]
[]
[]
[]
[]
[]
[]
[]
[]
[]
[]
[]
[]
[]
[]
[]
[]
[]
[]
[]
[]
[]
[]
[]
[]
[]
[]
[]
[]
[]
[]
[]
[]
[]
[]
[]
[]
[]
[]
[]
[]
[]
[]
[]
[]
[]
[]
[]
[]
[]
[]
[]
[]
[]
[]
[]
[]
[]
[]
[]
[]
[]
[]
[]
[]
[]
[]
[]
[]
[]
[]
[]
[]
[]
[]
[]
[]
[]
[]
[]
[]
[]
[]
[]
[]
[]
[]
[]
[]
[]
[]
[]
[]
[]
[]
[]
[]
[]
[]
[]
[]
[]
[]
[]
[]
[]
[]
[]
[]
[]
[]
[]
[]
[]
[]
[]
[]
[]
[]
[]
[]
[]
[]
[]
[]
[]
[]
[]
[]
[]
[]
[]
[]
[]
[]
[]
[]
[]
[]
[]
[]
[]
[]
[]
[]
[]
[]
[]
[]
[]
[]
[]
[]
[]
[]
[]
[]
[]
[]
[]
[]
[]
[]
[]
[]
[]
[]
[]
[]
[]
[]
[]
[]
[]
[]
[]
[]
[]
[]
[]
[]
[]
[]
[]
[]
[]
[]
[]
[]
[]
[]
[]
[]
[]
[]
[]
[]
[]
[]
[]
[]
[]
[]
[]
[]
[]
[]
[]
[]
[]
[]
[]
[]
[]
[]
[]
[]
[]
[]
[]
[]
[]
[]
[]
[]
[]
[]
[]
[]
[]
[]
[]
[]
[]
[]
[]
[]
[]
[]
[]
[]
[]
[]
[]
[]
[]
[]
[]
[]
[]
[]
[]
[]
[]
[]
[]
[]
[]
[]
[]
[]
[]
[]
[]
[]
[]
[]
[]
[]
[]
[]
[]
[]
[]
[]
[]
[]
[]
[]
[]
[]
[]
[]
[]
[]
[]
[]
[]
[]
[]
[]
[]
[]
[]
[]
[]
[]
[]
[]
[]
[]
[]
[]
[]
[]
[]
[]
[]
[]
[]
[]
[]
[]
[]
[]
[]
[]
[]
[]
[]
[]
[]
[]
[]
[]
[]
[]
[]
[]
[]
[]
[]
[]
[]
[]
[]
[]
[]
[]
[]
[]
[]
[]
[]
[]
[]
[]
[]
[]
[]
[]
[]
[]
[]
[]
[]
[]
[]
[]
[]
[]
[]
[]
[]
[]
[]
[]
[]
[]
[]
[]
[]
[]
[]
[]
[]
[]
[]
[]
[]
[]
[]
[]
[]
[]
[]
[]
[]
[]
[]
[]
[]
[]
[]
[]
[]
[]
[]
[]
[]
[]
[]
[]
[]
[]
[]
[]
[]
[]
[]
[]
[]
[]
[]
[]
[]
[]
[]
[]
[]
[]
[]
[]
[]
[]
[]
[]
[]
[]
[]
[]
[]
[]
[]
[]
[]
[]
[]
[]
[]
[]
[]
[]
[]
[]
[]
[]
[]
[]
[]
[]
[]
[]
[]
[]
[]
[]
[]
[]
[]
[]
[]
[]
[]
[]
[]
[]
[]
[]
[]
[]
[]
[]
[]
[]
[]
[]
[]
[]
[]
[]
[]
[]
[]
[]
[]
[]
[]
[]
[]
[]
[]
[]
[]
[]
[]
[]
[]
[]
[]
[]
[]
[]
[]
[]
[]
[]
[]
[]
[]
[]
[]
[]
[]
[]
[]
[]
[]
[]
[]
[]
[]
[]
[]
[]
[]
[]
[]
[]
[]
[]
[]
[]
[]
[]
[]
[]
[]
[]
[]
[]
[]
[]
[]
[]
[]
[]
[]
[]
[]
[]
[]
[]
[]
[]
[]
[]
[]
[]
[]
[]
[]
[]
[]
[]
[]
[]
[]
[]
[]
[]
[]
[]
[]
[]
[]
[]
[]
[]
[]
[]
[]
[]
[]
[]
[]
[]
[]
[]
[]
[]
[]
[]
[]
[]
[]
[]
[]
[]
[]
[]
[]
[]
[]
[]
[]
[]
[]
[]
[]
[]
[]
[]
[]
[]
[]
[]
[]
[]
[]
[]
[]
[]
[]
[]
[]
[]
[]
[]
[]
[]
[]
[]
[]
[]
[]
[]
[]
[]
[]
[]
[]
[]
[]
[]
[]
[]
[]
[]
[]
[]
[]
[]
[]
[]
[]
[]
[]
[]
[]
[]
[]
[]
[]
[]
[]
[]
[]
[]
[]
[]
[]
[]
[]
[]
[]
[]
[]
[]
[]
[]
[]
[]
[]
[]
[]
[]
[]
[]
[]
[]
[]
[]
[]
[]
[]
[]
[]
[]
[]
[]
[]
[]
[]
[]
[]
[]
[]
[]
[]
[]
[]
[]
[]
[]
[]
[]
[]
[]
[]
[]
[]
[]
[]
[]
[]
[]
[]
[]
[]
[]
[]
[]
[]
[]
[]
[]
[]
[]
[]
[]
[]
[]
[]
[]
[]
[]
[]
[]
[]
[]
[]
[]
[]
[]
[]
[]
[]
[]
[]
[]
[]
[]
[]
[]
[]
[]
[]
[]
[]
[]
[]
[]
[]
[]
[]
[]
[]
[]
[]
[]
[]
[]
[]
[]
[]
[]
[]
[]
[]
[]
[]
[]
[]
[]
[]
[]
[]
[]
[]
[]
[]
[]
[]
[]
[]
[]
[]
[]
[]
[]
[]
[]
[]
[]
[]
[]
[]
[]
[]
[]
[]
[]
[]
[]
[]
[]
[]
[]
[]
[]
[]
[]
[]
[]
[]
[]
[]
[]
[]
[]
[]
[]
[]
[]
[]
[]
[]
[]
[]
[]
[]
[]
[]
[]
[]
[]
[]
[]
[]
[]
[]
[]
[]
[]
[]
[]
[]
[]
[]
[]
[]
[]
[]
[]
[]
[]
[]
[]
[]
[]
[]
[]
[]
[]
[]
[]
[]
[]
[]
[]
[]
[]
[]
[]
[]
[]
[]
[]
[]
[]
[]
[]
[]
[]
[]
[]
[]
[]
[]
[]
[]
[]
[]
[]
[]
[]
[]
[]
[]
[]
[]
[]
[]
[]
[]
[]
[]
[]
[]
[]
[]
[]
[]
[]
[]
[]
[]
[]
[]
[]
[]
[]
[]
[]
[]
[]
[]
[]
[]
[]
[]
[]
[]
[]
[]
[]
[]
[]
[]
[]
[]
[]
[]
[]
[]
[]
[]
[]
[]
[]
[]
[]
[]
[]
[]
[]
[]
[]
[]
[]
[]
[]
[]
[]
[]
[]
[]
[]
[]
[]
[]
[]
[]
[]
[]
[]
[]
[]
[]
[]
[]
[]
[]
[]
[]
[]
[]
[]
[]
[]
[]
[]
[]
[]
[]
[]
[]
[]
[]
[]
[]
[]
[]
[]
[]
[]
[]
[]
[]
[]
[]
[]
[]
[]
[]
[]
[]
[]
[]
[]
[]
[]
[]
[]
[]
[]
[]
[]
[]
[]
[]
[]
[]
[]
[]
[]
[]
[]
[]
[]
[]
[]
[]
[]
[]
[]
[]
[]
[]
[]
[]
[]
[]
[]
[]
[]
[]
[]
[]
[]
[]
[]
[]
[]
[]
[]
[]
[]
[]
[]
[]
[]
[]
[]
[]
[]
[]
[]
[]
[]
[]
[]
[]
[]
[]
[]
[]
[]
[]
[]
[]
[]
[]
[]
[]
[]
[]
[]
[]
[]
[]
[]
[]
[]
[]
[]
[]
[]
[]
[]
[]
[]
[]
[]
[]
[]
[]
[]
[]
[]
[]
[]
[]
[]
[]
[]
[]
[]
[]
[]
[]
[]
[]
[]
[]
[]
[]
[]
[]
[]
[]
[]
[]
[]
[]
[]
[]
[]
[]
[]
[]
[]
[]
[]
[]
[]
[]
[]
[]
[]
[]
[]
[]
[]
[]
[]
[]
[]
[]
[]
[]
[]
[]
[]
[]
[]
[]
[]
[]
[]
[]
[]
[]
[]
[]
[]
[]
[]
[]
[]
[]
[]
[]
[]
[]
[]
[]
[]
[]
[]
[]
[]
[]
[]
[]
[]
[]
[]
[]
[]
[]
[]
[]
[]
[]
[]
[]
[]
[]
[]
[]
[]
[]
[]
[]
[]
[]
[]
[]
[]
[]
[]
[]
[]
[]
[]
[]
[]
[]
[]
[]
[]
[]
[]
[]
[]
[]
[]
[]
[]
[]
[]
[]
[]
[]
[]
[]
[]
[]
[]
[]
[]
[]
[]
[]
[]
[]
[]
[]
[]
[]
[]
[]
[]
[]
[]
[]
[]
[]
[]
[]
[]
[]
[]
[]
[]
[]
[]
[]
[]
[]
[]
[]
[]
[]
[]
[]
[]
[]
[]
[]
[]
[]
[]
[]
[]
[]
[]
[]
[]
[]
[]
[]
[]
[]
[]
[]
[]
[]
[]
[]
[]
[]
[]
[]
[]
[]
[]
[]
[]
[]
[]
[]
[]
[]
[]
[]
[]
[]
[]
[]
[]
[]
[]
[]
[]
[]
[]
[]
[]
[]
[]
[]
[]
[]
[]
[]
[]
[]
[]
[]
[]
[]
[]
[]
[]
[]
[]
[]
[]
[]
[]
[]
[]
[]
[]
[]
[]
[]
[]
[]
[]
[]
[]
[]
[]
[]
[]
[]
[]
[]
[]
[]
[]
[]
[]
[]
[]
[]
[]
[]
[]
[]
[]
[]
[]
[]
[]
[]
[]
[]
[]
[]
[]
[]
[]
[]
[]
[]
[]
[]
[]
[]
[]
[]
[]
[]
[]
[]
[]
[]
[]
[]
[]
[]
[]
[]
[]
[]
[]
[]
[]
[]
[]
[]
[]
[]
[]
[]
[]
[]
[]
[]
[]
[]
[]
[]
[]
[]
[]
[]
[]
[]
[]
[]
[]
[]
[]
[]
[]
[]
[]
[]
[]
[]
[]
[]
[]
[]
[]
[]
[]
[]
[]
[]
[]
[]
[]
[]
[]
[]
[]
[]
[]
[]
[]
[]
[]
[]
[]
[]
[]
[]
[]
[]
[]
[]
[]
[]
[]
[]
[]
[]
[]
[]
[]
[]
[]
[]
[]
[]
[]
[]
[]
[]
[]
[]
[]
[]
[]
[]
[]
[]
[]
[]
[]
[]
[]
[]
[]
[]
[]
[]
[]
[]
[]
[]
[]
[]
[]
[]
[]
[]
[]
[]
[]
[]
[]
[]
[]
[]
[]
[]
[]
[]
[]
[]
[]
[]
[]
[]
[]
[]
[]
[]
[]
[]
[]
[]
[]
[]
[]
[]
[]
[]
[]
[]
[]
[]
[]
[]
[]
[]
[]
[]
[]
[]
[]
[]
[]
[]
[]
[]
[]
[]
[]
[]
[]
[]
[]
[]
[]
[]
[]
[]
[]
[]
[]
[]
[]
[]
[]
[]
[]
[]
[]
[]
[]
[]
[]
[]
[]
[]
[]
[]
[]
[]
[]
[]
[]
[]
[]
[]
[]
[]
[]
[]
[]
[]
[]
[]
[]
[]
[]
[]
[]
[]
[]
[]
[]
[]
[]
[]
[]
[]
[]
[]
[]
[]
[]
[]
[]
[]
[]
[]
[]
[]
[]
[]
[]
[]
[]
[]
[]
[]
[]
[]
[]
[]
[]
[]
[]
[]
[]
[]
[]
[]
[]
[]
[]
[]
[]
[]
[]
[]
[]
[]
[]
[]
[]
[]
[]
[]
[]
[]
[]
[]
[]
[]
[]
[]
[]
[]
[]
[]
[]
[]
[]
[]
[]
[]
[]
[]
[]
[]
[]
[]
[]
[]
[]
[]
[]
[]
[]
[]
[]
[]
[]
[]
[]
[]
[]
[]
[]
[]
[]
[]
[]
[]
[]
[]
[]
[]
[]
[]
[]
[]
[]
[]
[]
[]
[]
[]
[]
[]
[]
[]
[]
[]
[]
[]
[]
[]
[]
[]
[]
[]
[]
[]
[]
[]
[]
[]
[]
[]
[]
[]
[]
[]
[]
[]
[]
[]
[]
[]
[]
[]
[]
[]
[]
[]
[]
[]
[]
[]
[]
[]
[]
[]
[]
[]
[]
[]
[]
[]
[]
[]
[]
[]
[]
[]
[]
[]
[]
[]
[]
[]
[]
[]
[]
[]
[]
[]
[]
[]
[]
[]
[]
[]
[]
[]
[]
[]
[]
[]
[]
[]
[]
[]
[]
[]
[]
[]
[]
[]
[]
[]
[]
[]
[]
[]
[]
[]
[]
[]
[]
[]
[]
[]
[]
[]
[]
[]
[]
[]
[]
[]
[]
[]
[]
[]
[]
[]
[]
[]
[]
[]
[]
[]
[]
[]
[]
[]
[]
[]
[]
[]
[]
[]
[]
[]
[]
[]
[]
[]
[]
[]
[]
[]
[]
[]
[]
[]
[]
[]
[]
[]
[]
[]
[]
[]
[]
[]
[]
[]
[]
[]
[]
[]
[]
[]
[]
[]
[]
[]
[]
[]
[]
[]
[]
[]
[]
[]
[]
[]
[]
[]
[]
[]
[]
[]
[]
[]
[]
[]
[]
[]
[]
[]
[]
[]
[]
[]
[]
[]
[]
[]
[]
[]
[]
[]
[]
[]
[]
[]
[]
[]
[]
[]
[]
[]
[]
[]
[]
[]
[]
[]
[]
[]
[]
[]
[]
[]
[]
[]
[]
[]
[]
[]
[]
[]
[]
[]
[]
[]
[]
[]
[]
[]
[]
[]
[]
[]
[]
[]
[]
[]
[]
[]
[]
[]
[]
[]
[]
[]
[]
[]
[]
[]
[]
[]
[]
[]
[]
[]
[]
[]
[]
[]
[]
[]
[]
[]
[]
[]
[]
[]
[]
[]
[]
[]
[]
[]
[]
[]
[]
[]
[]
[]
[]
[]
[]
[]
[]
[]
[]
[]
[]
[]
[]
[]
[]
[]
[]
[]
[]
[]
[]
[]
[]
[]
[]
[]
[]
[]
[]
[]
[]
[]
[]
[]
[]
[]
[]
[]
[]
[]
[]
[]
[]
[]
[]
[]
[]
[]
[]
[]
[]
[]
[]
[]
[]
[]
[]
[]
[]
[]
[]
[]
[]
[]
[]
[]
[]
[]
[]
[]
[]
[]
[]
[]
[]
[]
[]
[]
[]
[]
[]
[]
[]
[]
[]
[]
[]
[]
[]
[]
[]
[]
[]
[]
[]
[]
[]
[]
[]
[]
[]
[]
[]
[]
[]
[]
[]
[]
[]
[]
[]
[]
[]
[]
[]
[]
[]
[]
[]
[]
[]
[]
[]
[]
[]
[]
[]
[]
[]
[]
[]
[]
[]
[]
[]
[]
[]
[]
[]
[]
[]
[]
[]
[]
[]
[]
[]
[]
[]
[]
[]
[]
[]
[]
[]
[]
[]
[]
[]
[]
[]
[]
[]
[]
[]
[]
[]
[]
[]
[]
[]
[]
[]
[]
[]
[]
[]
[]
[]
[]
[]
[]
[]
[]
[]
[]
[]
[]
[]
[]
[]
[]
[]
[]
[]
[]
[]
[]
[]
[]
[]
[]
[]
[]
[]
[]
[]
[]
[]
[]
[]
[]
[]
[]
[]
[]
[]
[]
[]
[]
[]
[]
[]
[]
[]
[]
[]
[]
[]
[]
[]
[]
[]
[]
[]
[]
[]
[]
[]
[]
[]
[]
[]
[]
[]
[]
[]
[]
[]
[]
[]
[]
[]
[]
[]
[]
[]
[]
[]
[]
[]
[]
[]
[]
[]
[]
[]
[]
[]
[]
[]
[]
[]
[]
[]
[]
[]
[]
[]
[]
[]
[]
[]
[]
[]
[]
[]
[]
[]
[]
[]
[]
[]
[]
[]
[]
[]
[]
[]
[]
[]
[]
[]
[]
[]
[]
[]
[]
[]
[]
[]
[]
[]
[]
[]
[]
[]
[]
[]
[]
[]
[]
[]
[]
[]
[]
[]
[]
[]
[]
[]
[]
[]
[]
[]
[]
[]
[]
[]
[]
[]
[]
[]
[]
[]
[]
[]
[]
[]
[]
[]
[]
[]
[]
[]
[]
[]
[]
[]
[]
[]
[]
[]
[]
[]
[]
[]
[]
[]
[]
[]
[]
[]
[]
[]
[]
[]
[]
[]
[]
[]
[]
[]
[]
[]
[]
[]
[]
[]
[]
[]
[]
[]
[]
[]
[]
[]
[]
[]
[]
[]
[]
[]
[]
[]
[]
[]
[]
[]
[]
[]
[]
[]
[]
[]
[]
[]
[]
[]
[]
[]
[]
[]
[]
[]
[]
[]
[]
[]
[]
[]
[]
[]
[]
[]
[]
[]
[]
[]
[]
[]
[]
[]
[]
[]
[]
[]
[]
[]
[]
[]
[]
[]
[]
[]
[]
[]
[]
[]
[]
[]
[]
[]
[]
[]
[]
[]
[]
[]
[]
[]
[]
[]
[]
[]
[]
[]
[]
[]
[]
[]
[]
[]
[]
[]
[]
[]
[]
[]
[]
[]
[]
[]
[]
[]
[]
[]
[]
[]
[]
[]
[]
[]
[]
[]
[]
[]
[]
[]
[]
[]
[]
[]
[]
[]
[]
[]
[]
[]
[]
[]
[]
[]
[]
[]
[]
[]
[]
[]
[]
[]
[]
[]
[]
[]
[]
[]
[]
[]
[]
[]
[]
[]
[]
[]
[]
[]
[]
[]
[]
[]
[]
[]
[]
[]
[]
[]
[]
[]
[]
[]
[]
[]
[]
[]
[]
[]
[]
[]
[]
[]
[]
[]
[]
[]
[]
[]
[]
[]
[]
[]
[]
[]
[]
[]
[]
[]
[]
[]
[]
[]
[]
[]
[]
[]
[]
[]
[]
[]
[]
[]
[]
[]
[]
[]
[]
[]
[]
[]
[]
[]
[]
[]
[]
[]
[]
[]
[]
[]
[]
[]
[]
[]
[]
[]
[]
[]
[]
[]
[]
[]
[]
[]
[]
[]
[]
[]
[]
[]
[]
[]
[]
[]
[]
[]
[]
[]
[]
[]
[]
[]
[]
[]
[]
[]
[]
[]
[]
[]
[]
[]
[]
[]
[]
[]
[]
[]
[]
[]
[]
[]
[]
[]
[]
[]
[{"$f":"'05 CPD'!H1","v":"BREAKDOWN BY MAIN CATEGORY/TYPE"},{"$f":"IF('05 CPD'!H2=\"\",\"-\",'05 CPD'!H2)","v":"STEM Activities or Other Volunteering"},{"$f":"IF('05 CPD'!I2=\"\",\"-\",'05 CPD'!I2)","v":"ICE Involvement"},{"$f":"IF('05 CPD'!J2=\"\",\"-\",'05 CPD'!J2)","v":"Knowledge & Learning"},{"$f":"IF('05 CPD'!K2=\"\",\"-\",'05 CPD'!K2)","v":"On the Job Learning"},{"$f":"IF('05 CPD'!L2=\"\",\"-\",'05 CPD'!L2)","v":"Technical Development"},{"$f":"IF('05 CPD'!M2=\"\",\"-\",'05 CPD'!M2)","v":"Soft Skills Development"},{"$f":"IF('05 CPD'!N2=\"\",\"-\",'05 CPD'!N2)","v":"Mentoring"},{"$f":"IF('05 CPD'!O2=\"\",\"-\",'05 CPD'!O2)","v":"Other"},{"$f":"IF('05 CPD'!P2=\"\",\"-\",'05 CPD'!P2)","v":"-"},{"$f":"IF('05 CPD'!Q2=\"\",\"-\",'05 CPD'!Q2)","v":"-"},{"$f":"IF('05 CPD'!R2=\"\",\"-\",'05 CPD'!R2)","v":"-"}]
[{"$f":"'05 CPD'!T1","v":"BREAKDOWN BY SUB-CATEGORY"},{"$f":"IF('05 CPD'!T2=\"\",\"-\",'05 CPD'!T2)","v":"Health & Safety"},{"$f":"IF('05 CPD'!U2=\"\",\"-\",'05 CPD'!U2)","v":"Commercial, Contracts & Law"},{"$f":"IF('05 CPD'!V2=\"\",\"-\",'05 CPD'!V2)","v":"Management & Leadership"},{"$f":"IF('05 CPD'!W2=\"\",\"-\",'05 CPD'!W2)","v":"Techncial"},{"$f":"IF('05 CPD'!X2=\"\",\"-\",'05 CPD'!X2)","v":"Financial"},{"$f":"IF('05 CPD'!Y2=\"\",\"-\",'05 CPD'!Y2)","v":"IT, BIM & Emerging Technologies"},{"$f":"IF('05 CPD'!Z2=\"\",\"-\",'05 CPD'!Z2)","v":"History"},{"$f":"IF('05 CPD'!AA2=\"\",\"-\",'05 CPD'!AA2)","v":"Professionalism, Ethics, Equality & Diversity"},{"$f":"IF('05 CPD'!AB2=\"\",\"-\",'05 CPD'!AB2)","v":"Security"},{"$f":"IF('05 CPD'!AC2=\"\",\"-\",'05 CPD'!AC2)","v":"Sustainability"},{"$f":"IF('05 CPD'!AD2=\"\",\"-\",'05 CPD'!AD2)","v":"Quality"},{"$f":"IF('05 CPD'!AE2=\"\",\"-\",'05 CPD'!AE2)","v":"Other"},{"$f":"IF('05 CPD'!AF2=\"\",\"-\",'05 CPD'!AF2)","v":"-"}]
[]
[]
[]
[{"$f":"'05 CPD'!A2","v":"Annual Period"},null,null,"DAP Ref"]
[{"$f":"IF('05 CPD'!A3=\"\",\"-\",'05 CPD'!A3)","v":"Sept 2007 - Aug 2008"},null,null,{"$f":"IF('06 DAP'!D4=\"\",\"\",'06 DAP'!D4)","v":1}]
[{"$f":"IF('05 CPD'!A4=\"\",\"-\",'05 CPD'!A4)","v":"Sept 2008 - Aug 2009"},null,null,{"$f":"IF('06 DAP'!D5=\"\",\"\",'06 DAP'!D5)","v":2}]
[{"$f":"IF('05 CPD'!A5=\"\",\"-\",'05 CPD'!A5)","v":"Sept 2009 - Aug 2010"},null,null,{"$f":"IF('06 DAP'!D6=\"\",\"\",'06 DAP'!D6)","v":3}]
[{"$f":"IF('05 CPD'!A6=\"\",\"-\",'05 CPD'!A6)","v":"Sept 2010 - Aug 2011"},null,null,{"$f":"IF('06 DAP'!D7=\"\",\"\",'06 DAP'!D7)","v":4}]
[{"$f":"IF('05 CPD'!A7=\"\",\"-\",'05 CPD'!A7)","v":"Sept 2011 - Aug 2012"},null,null,{"$f":"IF('06 DAP'!D8=\"\",\"\",'06 DAP'!D8)","v":5}]
[{"$f":"IF('05 CPD'!A8=\"\",\"-\",'05 CPD'!A8)","v":"Sept 2012 - Aug 2013"},null,null,{"$f":"IF('06 DAP'!D9=\"\",\"\",'06 DAP'!D9)","v":6}]
[{"$f":"IF('05 CPD'!A9=\"\",\"-\",'05 CPD'!A9)","v":"Sept 2013 - Dec 2014"},null,null,{"$f":"IF('06 DAP'!D10=\"\",\"\",'06 DAP'!D10)","v":7}]
[{"$f":"IF('05 CPD'!A10=\"\",\"-\",'05 CPD'!A10)","v":"Jan 2015 - Aug 2015"},null,null,{"$f":"IF('06 DAP'!D11=\"\",\"\",'06 DAP'!D11)","v":8}]
[{"$f":"IF('05 CPD'!A11=\"\",\"-\",'05 CPD'!A11)","v":"Sept 2015 - Aug 2016"},null,null,{"$f":"IF('06 DAP'!D12=\"\",\"\",'06 DAP'!D12)","v":9}]
[{"$f":"IF('05 CPD'!A12=\"\",\"-\",'05 CPD'!A12)","v":"Sept 2016 - Aug 2017"},null,null,{"$f":"IF('06 DAP'!D13=\"\",\"\",'06 DAP'!D13)","v":10}]
[{"$f":"IF('05 CPD'!A13=\"\",\"-\",'05 CPD'!A13)","v":"Sept 2017 - Aug 2018"},null,null,{"$f":"IF('06 DAP'!D14=\"\",\"\",'06 DAP'!D14)","v":11}]
[{"$f":"IF('05 CPD'!A14=\"\",\"-\",'05 CPD'!A14)","v":"Sept 2018 - Aug 2019"},null,null,{"$f":"IF('06 DAP'!D15=\"\",\"\",'06 DAP'!D15)","v":12}]
[{"$f":"IF('05 CPD'!A15=\"\",\"-\",'05 CPD'!A15)","v":"Sept 2019 - Aug 2020"},null,null,{"$f":"IF('06 DAP'!D16=\"\",\"\",'06 DAP'!D16)","v":13}]
[{"$f":"IF('05 CPD'!A16=\"\",\"-\",'05 CPD'!A16)","v":"<Insert Period Range for Period 15>"},null,null,{"$f":"IF('06 DAP'!D17=\"\",\"\",'06 DAP'!D17)","v":14}]
[{"$f":"IF('05 CPD'!A17=\"\",\"-\",'05 CPD'!A17)","v":"<Insert Period Range for Period 15>"},null,null,{"$f":"IF('06 DAP'!D18=\"\",\"\",'06 DAP'!D18)","v":15}]
[{"$f":"IF('05 CPD'!A18=\"\",\"-\",'05 CPD'!A18)","v":"<Insert Period Range for Period 16>"},null,null,{"$f":"IF('06 DAP'!D19=\"\",\"\",'06 DAP'!D19)","v":16}]
[{"$f":"IF('05 CPD'!A19=\"\",\"-\",'05 CPD'!A19)","v":"<Insert Period Range for Period 17>"},null,null,{"$f":"IF('06 DAP'!D20=\"\",\"\",'06 DAP'!D20)","v":17}]
[{"$f":"IF('05 CPD'!A20=\"\",\"-\",'05 CPD'!A20)","v":"<Insert Period Range for Period 18>"},null,null,{"$f":"IF('06 DAP'!D21=\"\",\"\",'06 DAP'!D21)","v":18}]
[{"$f":"IF('05 CPD'!A21=\"\",\"-\",'05 CPD'!A21)","v":"<Insert Period Range for Period 19>"},null,null,{"$f":"IF('06 DAP'!D22=\"\",\"\",'06 DAP'!D22)","v":19}]
[{"$f":"IF('05 CPD'!A22=\"\",\"-\",'05 CPD'!A22)","v":"<Insert Period Range for Period 20>"},null,null,{"$f":"IF('06 DAP'!D23=\"\",\"\",'06 DAP'!D23)","v":20}]
[{"$f":"IF('05 CPD'!A23=\"\",\"-\",'05 CPD'!A23)","v":"<Insert Period Range for Period 21>"},null,null,{"$f":"IF('06 DAP'!D24=\"\",\"\",'06 DAP'!D24)","v":21}]
[{"$f":"IF('05 CPD'!A24=\"\",\"-\",'05 CPD'!A24)","v":"<Insert Period Range for Period 22>"},null,null,{"$f":"IF('06 DAP'!D25=\"\",\"\",'06 DAP'!D25)","v":22}]
[{"$f":"IF('05 CPD'!A25=\"\",\"-\",'05 CPD'!A25)","v":"<Insert Period Range for Period 23>"},null,null,{"$f":"IF('06 DAP'!D26=\"\",\"\",'06 DAP'!D26)","v":23}]
[{"$f":"IF('05 CPD'!A26=\"\",\"-\",'05 CPD'!A26)","v":"<Insert Period Range for Period 24>"},null,null,{"$f":"IF('06 DAP'!D27=\"\",\"\",'06 DAP'!D27)","v":24}]
[{"$f":"IF('05 CPD'!A27=\"\",\"-\",'05 CPD'!A27)","v":"<Insert Period Range for Period 25>"},null,null,{"$f":"IF('06 DAP'!D28=\"\",\"\",'06 DAP'!D28)","v":25}]
[{"$f":"IF('05 CPD'!A42=\"\",\"-\",'05 CPD'!A42)","v":"<Insert Period Range for Period 40>"},null,null,{"$f":"IF('06 DAP'!D29=\"\",\"\",'06 DAP'!D29)","v":26}]
[{"$f":"IF('05 CPD'!A43=\"\",\"-\",'05 CPD'!A43)","v":"<Insert Period Range for Period 41>"},null,null,{"$f":"IF('06 DAP'!D30=\"\",\"\",'06 DAP'!D30)","v":27}]
[{"$f":"IF('05 CPD'!A44=\"\",\"-\",'05 CPD'!A44)","v":"<Insert Period Range for Period 42>"},null,null,{"$f":"IF('06 DAP'!D31=\"\",\"\",'06 DAP'!D31)","v":28}]
[null,null,null,{"$f":"IF('06 DAP'!D32=\"\",\"\",'06 DAP'!D32)","v":29}]
[null,null,null,{"$f":"IF('06 DAP'!D33=\"\",\"\",'06 DAP'!D33)","v":30}]
[null,null,null,{"$f":"IF('06 DAP'!D34=\"\",\"\",'06 DAP'!D34)","v":31}]
[null,null,null,{"$f":"IF('06 DAP'!D35=\"\",\"\",'06 DAP'!D35)","v":32}]
[null,null,null,{"$f":"IF('06 DAP'!D36=\"\",\"\",'06 DAP'!D36)","v":33}]
[null,null,null,{"$f":"IF('06 DAP'!D37=\"\",\"\",'06 DAP'!D37)","v":34}]
[null,null,null,{"$f":"IF('06 DAP'!D38=\"\",\"\",'06 DAP'!D38)","v":35}]
[null,null,null,{"$f":"IF('06 DAP'!D39=\"\",\"\",'06 DAP'!D39)","v":36}]
[null,null,null,{"$f":"IF('06 DAP'!D40=\"\",\"\",'06 DAP'!D40)","v":37}]
[null,null,null,{"$f":"IF('06 DAP'!D41=\"\",\"\",'06 DAP'!D41)","v":38}]
[null,null,null,{"$f":"IF('06 DAP'!D42=\"\",\"\",'06 DAP'!D42)","v":39}]
[null,null,null,{"$f":"IF('06 DAP'!D43=\"\",\"\",'06 DAP'!D43)","v":40}]
[null,null,null,{"$f":"IF('06 DAP'!D44=\"\",\"\",'06 DAP'!D44)","v":41}]
[null,null,null,{"$f":"IF('06 DAP'!D45=\"\",\"\",'06 DAP'!D45)","v":42}]
[null,null,null,{"$f":"IF('06 DAP'!D46=\"\",\"\",'06 DAP'!D46)","v":43}]
[null,null,null,{"$f":"IF('06 DAP'!D47=\"\",\"\",'06 DAP'!D47)","v":44}]
[null,null,null,{"$f":"IF('06 DAP'!D48=\"\",\"\",'06 DAP'!D48)","v":45}]
[null,null,null,{"$f":"IF('06 DAP'!D49=\"\",\"\",'06 DAP'!D49)","v":46}]
[null,null,null,{"$f":"IF('06 DAP'!D50=\"\",\"\",'06 DAP'!D50)","v":47}]
[null,null,null,{"$f":"IF('06 DAP'!D51=\"\",\"\",'06 DAP'!D51)","v":48}]
[null,null,null,{"$f":"IF('06 DAP'!D52=\"\",\"\",'06 DAP'!D52)","v":49}]
[null,null,null,{"$f":"IF('06 DAP'!D53=\"\",\"\",'06 DAP'!D53)","v":50}]
[null,null,null,{"$f":"IF('06 DAP'!D54=\"\",\"\",'06 DAP'!D54)","v":51}]
[null,null,null,{"$f":"IF('06 DAP'!D55=\"\",\"\",'06 DAP'!D55)","v":52}]
[null,null,null,{"$f":"IF('06 DAP'!D56=\"\",\"\",'06 DAP'!D56)","v":53}]
[null,null,null,{"$f":"IF('06 DAP'!D57=\"\",\"\",'06 DAP'!D57)","v":54}]
[null,null,null,{"$f":"IF('06 DAP'!D58=\"\",\"\",'06 DAP'!D58)","v":55}]
[null,null,null,{"$f":"IF('06 DAP'!D59=\"\",\"\",'06 DAP'!D59)","v":56}]
[null,null,null,{"$f":"IF('06 DAP'!D60=\"\",\"\",'06 DAP'!D60)","v":57}]
[null,null,null,{"$f":"IF('06 DAP'!D61=\"\",\"\",'06 DAP'!D61)","v":58}]
[null,null,null,{"$f":"IF('06 DAP'!D62=\"\",\"\",'06 DAP'!D62)","v":59}]
[null,null,null,{"$f":"IF('06 DAP'!D63=\"\",\"\",'06 DAP'!D63)","v":60}]
[null,null,null,{"$f":"IF('06 DAP'!D64=\"\",\"\",'06 DAP'!D64)","v":61}]
[null,null,null,{"$f":"IF('06 DAP'!D65=\"\",\"\",'06 DAP'!D65)","v":62}]
[null,null,null,{"$f":"IF('06 DAP'!D66=\"\",\"\",'06 DAP'!D66)","v":63}]
[null,null,null,{"$f":"IF('06 DAP'!D67=\"\",\"\",'06 DAP'!D67)","v":64}]
[null,null,null,{"$f":"IF('06 DAP'!D68=\"\",\"\",'06 DAP'!D68)","v":65}]
[null,null,null,{"$f":"IF('06 DAP'!D69=\"\",\"\",'06 DAP'!D69)","v":66}]
[null,null,null,{"$f":"IF('06 DAP'!D70=\"\",\"\",'06 DAP'!D70)","v":67}]
[null,null,null,{"$f":"IF('06 DAP'!D71=\"\",\"\",'06 DAP'!D71)","v":68}]
[null,null,null,{"$f":"IF('06 DAP'!D72=\"\",\"\",'06 DAP'!D72)","v":69}]
[null,null,null,{"$f":"IF('06 DAP'!D73=\"\",\"\",'06 DAP'!D73)","v":70}]
[null,null,null,{"$f":"IF('06 DAP'!D74=\"\",\"\",'06 DAP'!D74)","v":71}]
[null,null,null,{"$f":"IF('06 DAP'!D75=\"\",\"\",'06 DAP'!D75)","v":72}]
[null,null,null,{"$f":"IF('06 DAP'!D76=\"\",\"\",'06 DAP'!D76)","v":73}]
[null,null,null,{"$f":"IF('06 DAP'!D77=\"\",\"\",'06 DAP'!D77)","v":74}]
[null,null,null,{"$f":"IF('06 DAP'!D78=\"\",\"\",'06 DAP'!D78)","v":75}]
[null,null,null,{"$f":"IF('06 DAP'!D79=\"\",\"\",'06 DAP'!D79)","v":76}]
[null,null,null,{"$f":"IF('06 DAP'!D80=\"\",\"\",'06 DAP'!D80)","v":77}]
[null,null,null,{"$f":"IF('06 DAP'!D81=\"\",\"\",'06 DAP'!D81)","v":78}]
[null,null,null,{"$f":"IF('06 DAP'!D82=\"\",\"\",'06 DAP'!D82)","v":79}]
[null,null,null,{"$f":"IF('06 DAP'!D83=\"\",\"\",'06 DAP'!D83)","v":80}]
[null,null,null,{"$f":"IF('06 DAP'!D84=\"\",\"\",'06 DAP'!D84)","v":81}]
[null,null,null,{"$f":"IF('06 DAP'!D85=\"\",\"\",'06 DAP'!D85)","v":82}]
[null,null,null,{"$f":"IF('06 DAP'!D86=\"\",\"\",'06 DAP'!D86)","v":83}]
[null,null,null,{"$f":"IF('06 DAP'!D87=\"\",\"\",'06 DAP'!D87)","v":84}]
[null,null,null,{"$f":"IF('06 DAP'!D88=\"\",\"\",'06 DAP'!D88)","v":85}]
[null,null,null,{"$f":"IF('06 DAP'!D89=\"\",\"\",'06 DAP'!D89)","v":86}]
[null,null,null,{"$f":"IF('06 DAP'!D90=\"\",\"\",'06 DAP'!D90)","v":87}]
[null,null,null,{"$f":"IF('06 DAP'!D91=\"\",\"\",'06 DAP'!D91)","v":88}]
[null,null,null,{"$f":"IF('06 DAP'!D92=\"\",\"\",'06 DAP'!D92)","v":89}]
[null,null,null,{"$f":"IF('06 DAP'!D93=\"\",\"\",'06 DAP'!D93)","v":90}]
[null,null,null,{"$f":"IF('06 DAP'!D94=\"\",\"\",'06 DAP'!D94)","v":91}]
[null,null,null,{"$f":"IF('06 DAP'!D95=\"\",\"\",'06 DAP'!D95)","v":92}]
[null,null,null,{"$f":"IF('06 DAP'!D96=\"\",\"\",'06 DAP'!D96)","v":93}]
[null,null,null,{"$f":"IF('06 DAP'!D97=\"\",\"\",'06 DAP'!D97)","v":94}]
[null,null,null,{"$f":"IF('06 DAP'!D98=\"\",\"\",'06 DAP'!D98)","v":95}]
[null,null,null,{"$f":"IF('06 DAP'!D99=\"\",\"\",'06 DAP'!D99)","v":96}]
[null,null,null,{"$f":"IF('06 DAP'!D100=\"\",\"\",'06 DAP'!D100)","v":97}]
[null,null,null,{"$f":"IF('06 DAP'!D101=\"\",\"\",'06 DAP'!D101)","v":98}]
[null,null,null,{"$f":"IF('06 DAP'!D102=\"\",\"\",'06 DAP'!D102)","v":99}]
[null,null,null,{"$f":"IF('06 DAP'!D103=\"\",\"\",'06 DAP'!D103)","v":100}]
[null,null,null,{"$f":"IF('06 DAP'!D104=\"\",\"\",'06 DAP'!D104)","v":101}]
[null,null,null,{"$f":"IF('06 DAP'!D105=\"\",\"\",'06 DAP'!D105)","v":102}]
[null,null,null,{"$f":"IF('06 DAP'!D106=\"\",\"\",'06 DAP'!D106)","v":103}]
[null,null,null,{"$f":"IF('06 DAP'!D107=\"\",\"\",'06 DAP'!D107)","v":104}]
[null,null,null,{"$f":"IF('06 DAP'!D108=\"\",\"\",'06 DAP'!D108)","v":105}]
[null,null,null,{"$f":"IF('06 DAP'!D109=\"\",\"\",'06 DAP'!D109)","v":106}]
[null,null,null,{"$f":"IF('06 DAP'!D110=\"\",\"\",'06 DAP'!D110)","v":107}]
[null,null,null,{"$f":"IF('06 DAP'!D111=\"\",\"\",'06 DAP'!D111)","v":108}]
[null,null,null,{"$f":"IF('06 DAP'!D112=\"\",\"\",'06 DAP'!D112)","v":109}]
[null,null,null,{"$f":"IF('06 DAP'!D113=\"\",\"\",'06 DAP'!D113)","v":110}]
[null,null,null,{"$f":"IF('06 DAP'!D114=\"\",\"\",'06 DAP'!D114)","v":111}]
[null,null,null,{"$f":"IF('06 DAP'!D115=\"\",\"\",'06 DAP'!D115)","v":112}]
[null,null,null,{"$f":"IF('06 DAP'!D116=\"\",\"\",'06 DAP'!D116)","v":113}]
[null,null,null,{"$f":"IF('06 DAP'!D117=\"\",\"\",'06 DAP'!D117)","v":114}]
[null,null,null,{"$f":"IF('06 DAP'!D118=\"\",\"\",'06 DAP'!D118)","v":115}]
[null,null,null,{"$f":"IF('06 DAP'!D119=\"\",\"\",'06 DAP'!D119)","v":116}]
[null,null,null,{"$f":"IF('06 DAP'!D120=\"\",\"\",'06 DAP'!D120)","v":117}]
[null,null,null,{"$f":"IF('06 DAP'!D121=\"\",\"\",'06 DAP'!D121)","v":118}]
[null,null,null,{"$f":"IF('06 DAP'!D122=\"\",\"\",'06 DAP'!D122)","v":119}]
[null,null,null,{"$f":"IF('06 DAP'!D123=\"\",\"\",'06 DAP'!D123)","v":120}]
[null,null,null,{"$f":"IF('06 DAP'!D124=\"\",\"\",'06 DAP'!D124)","v":121}]
[null,null,null,{"$f":"IF('06 DAP'!D125=\"\",\"\",'06 DAP'!D125)","v":122}]
[null,null,null,{"$f":"IF('06 DAP'!D126=\"\",\"\",'06 DAP'!D126)","v":123}]
[null,null,null,{"$f":"IF('06 DAP'!D127=\"\",\"\",'06 DAP'!D127)","v":124}]
[null,null,null,{"$f":"IF('06 DAP'!D128=\"\",\"\",'06 DAP'!D128)","v":125}]
[null,null,null,{"$f":"IF('06 DAP'!D129=\"\",\"\",'06 DAP'!D129)","v":126}]
[null,null,null,{"$f":"IF('06 DAP'!D130=\"\",\"\",'06 DAP'!D130)","v":127}]
[null,null,null,{"$f":"IF('06 DAP'!D131=\"\",\"\",'06 DAP'!D131)","v":128}]
[null,null,null,{"$f":"IF('06 DAP'!D132=\"\",\"\",'06 DAP'!D132)","v":129}]
[null,null,null,{"$f":"IF('06 DAP'!D133=\"\",\"\",'06 DAP'!D133)","v":130}]
[null,null,null,{"$f":"IF('06 DAP'!D134=\"\",\"\",'06 DAP'!D134)","v":131}]
[null,null,null,{"$f":"IF('06 DAP'!D135=\"\",\"\",'06 DAP'!D135)","v":132}]
[null,null,null,{"$f":"IF('06 DAP'!D136=\"\",\"\",'06 DAP'!D136)","v":133}]
[null,null,null,{"$f":"IF('06 DAP'!D137=\"\",\"\",'06 DAP'!D137)","v":134}]
[null,null,null,{"$f":"IF('06 DAP'!D138=\"\",\"\",'06 DAP'!D138)","v":135}]
[null,null,null,{"$f":"IF('06 DAP'!D139=\"\",\"\",'06 DAP'!D139)","v":136}]
[null,null,null,{"$f":"IF('06 DAP'!D140=\"\",\"\",'06 DAP'!D140)","v":137}]
[null,null,null,{"$f":"IF('06 DAP'!D141=\"\",\"\",'06 DAP'!D141)","v":138}]
[null,null,null,{"$f":"IF('06 DAP'!D142=\"\",\"\",'06 DAP'!D142)","v":139}]
[null,null,null,{"$f":"IF('06 DAP'!D143=\"\",\"\",'06 DAP'!D143)","v":140}]
[null,null,null,{"$f":"IF('06 DAP'!D144=\"\",\"\",'06 DAP'!D144)","v":141}]
[null,null,null,{"$f":"IF('06 DAP'!D145=\"\",\"\",'06 DAP'!D145)","v":142}]
[null,null,null,{"$f":"IF('06 DAP'!D146=\"\",\"\",'06 DAP'!D146)","v":143}]
[null,null,null,{"$f":"IF('06 DAP'!D147=\"\",\"\",'06 DAP'!D147)","v":144}]
[null,null,null,{"$f":"IF('06 DAP'!D148=\"\",\"\",'06 DAP'!D148)","v":145}]
[null,null,null,{"$f":"IF('06 DAP'!D149=\"\",\"\",'06 DAP'!D149)","v":146}]
[null,null,null,{"$f":"IF('06 DAP'!D150=\"\",\"\",'06 DAP'!D150)","v":147}]
[null,null,null,{"$f":"IF('06 DAP'!D151=\"\",\"\",'06 DAP'!D151)","v":148}]
[null,null,null,{"$f":"IF('06 DAP'!D152=\"\",\"\",'06 DAP'!D152)","v":149}]
[null,null,null,{"$f":"IF('06 DAP'!D153=\"\",\"\",'06 DAP'!D153)","v":150}]
[null,null,null,{"$f":"IF('06 DAP'!D154=\"\",\"\",'06 DAP'!D154)","v":151}]
[null,null,null,{"$f":"IF('06 DAP'!D155=\"\",\"\",'06 DAP'!D155)","v":152}]
[null,null,null,{"$f":"IF('06 DAP'!D156=\"\",\"\",'06 DAP'!D156)","v":153}]
[null,null,null,{"$f":"IF('06 DAP'!D157=\"\",\"\",'06 DAP'!D157)","v":154}]
[null,null,null,{"$f":"IF('06 DAP'!D158=\"\",\"\",'06 DAP'!D158)","v":155}]
[null,null,null,{"$f":"IF('06 DAP'!D159=\"\",\"\",'06 DAP'!D159)","v":156}]
[null,null,null,{"$f":"IF('06 DAP'!D160=\"\",\"\",'06 DAP'!D160)","v":157}]
[null,null,null,{"$f":"IF('06 DAP'!D161=\"\",\"\",'06 DAP'!D161)","v":158}]
[null,null,null,{"$f":"IF('06 DAP'!D162=\"\",\"\",'06 DAP'!D162)","v":159}]
[null,null,null,{"$f":"IF('06 DAP'!D163=\"\",\"\",'06 DAP'!D163)","v":160}]
[null,null,null,{"$f":"IF('06 DAP'!D164=\"\",\"\",'06 DAP'!D164)","v":161}]
[null,null,null,{"$f":"IF('06 DAP'!D165=\"\",\"\",'06 DAP'!D165)","v":162}]
[null,null,null,{"$f":"IF('06 DAP'!D166=\"\",\"\",'06 DAP'!D166)","v":163}]
[null,null,null,{"$f":"IF('06 DAP'!D167=\"\",\"\",'06 DAP'!D167)","v":164}]
[null,null,null,{"$f":"IF('06 DAP'!D168=\"\",\"\",'06 DAP'!D168)","v":165}]
[null,null,null,{"$f":"IF('06 DAP'!D169=\"\",\"\",'06 DAP'!D169)","v":166}]
[null,null,null,{"$f":"IF('06 DAP'!D170=\"\",\"\",'06 DAP'!D170)","v":167}]
[null,null,null,{"$f":"IF('06 DAP'!D171=\"\",\"\",'06 DAP'!D171)","v":168}]
[null,null,null,{"$f":"IF('06 DAP'!D172=\"\",\"\",'06 DAP'!D172)","v":169}]
[null,null,null,{"$f":"IF('06 DAP'!D173=\"\",\"\",'06 DAP'!D173)","v":170}]
[null,null,null,{"$f":"IF('06 DAP'!D174=\"\",\"\",'06 DAP'!D174)","v":171}]
[null,null,null,{"$f":"IF('06 DAP'!D175=\"\",\"\",'06 DAP'!D175)","v":172}]
[null,null,null,{"$f":"IF('06 DAP'!D176=\"\",\"\",'06 DAP'!D176)","v":173}]
[null,null,null,{"$f":"IF('06 DAP'!D177=\"\",\"\",'06 DAP'!D177)","v":174}]
[null,null,null,{"$f":"IF('06 DAP'!D178=\"\",\"\",'06 DAP'!D178)","v":175}]
[null,null,null,{"$f":"IF('06 DAP'!D179=\"\",\"\",'06 DAP'!D179)","v":176}]
[null,null,null,{"$f":"IF('06 DAP'!D180=\"\",\"\",'06 DAP'!D180)","v":177}]
[null,null,null,{"$f":"IF('06 DAP'!D181=\"\",\"\",'06 DAP'!D181)","v":178}]
[null,null,null,{"$f":"IF('06 DAP'!D182=\"\",\"\",'06 DAP'!D182)","v":179}]
[null,null,null,{"$f":"IF('06 DAP'!D183=\"\",\"\",'06 DAP'!D183)","v":180}]
[null,null,null,{"$f":"IF('06 DAP'!D184=\"\",\"\",'06 DAP'!D184)","v":181}]
[null,null,null,{"$f":"IF('06 DAP'!D185=\"\",\"\",'06 DAP'!D185)","v":182}]
[null,null,null,{"$f":"IF('06 DAP'!D186=\"\",\"\",'06 DAP'!D186)","v":183}]
[null,null,null,{"$f":"IF('06 DAP'!D187=\"\",\"\",'06 DAP'!D187)","v":184}]
[null,null,null,{"$f":"IF('06 DAP'!D188=\"\",\"\",'06 DAP'!D188)","v":185}]
[null,null,null,{"$f":"IF('06 DAP'!D189=\"\",\"\",'06 DAP'!D189)","v":186}]
[null,null,null,{"$f":"IF('06 DAP'!D190=\"\",\"\",'06 DAP'!D190)","v":187}]
[null,null,null,{"$f":"IF('06 DAP'!D191=\"\",\"\",'06 DAP'!D191)","v":188}]
[null,null,null,{"$f":"IF('06 DAP'!D192=\"\",\"\",'06 DAP'!D192)","v":189}]
[null,null,null,{"$f":"IF('06 DAP'!D193=\"\",\"\",'06 DAP'!D193)","v":190}]
[null,null,null,{"$f":"IF('06 DAP'!D194=\"\",\"\",'06 DAP'!D194)","v":191}]
[null,null,null,{"$f":"IF('06 DAP'!D195=\"\",\"\",'06 DAP'!D195)","v":192}]
[null,null,null,{"$f":"IF('06 DAP'!D196=\"\",\"\",'06 DAP'!D196)","v":193}]
[null,null,null,{"$f":"IF('06 DAP'!D197=\"\",\"\",'06 DAP'!D197)","v":194}]
[null,null,null,{"$f":"IF('06 DAP'!D198=\"\",\"\",'06 DAP'!D198)","v":195}]
[null,null,null,{"$f":"IF('06 DAP'!D199=\"\",\"\",'06 DAP'!D199)","v":196}]
[null,null,null,{"$f":"IF('06 DAP'!D200=\"\",\"\",'06 DAP'!D200)","v":197}]
[null,null,null,{"$f":"IF('06 DAP'!D201=\"\",\"\",'06 DAP'!D201)","v":198}]
[null,null,null,{"$f":"IF('06 DAP'!D202=\"\",\"\",'06 DAP'!D202)","v":199}]
[null,null,null,{"$f":"IF('06 DAP'!D203=\"\",\"\",'06 DAP'!D203)","v":200}]
[null,null,null,{"$f":"IF('06 DAP'!D204=\"\",\"\",'06 DAP'!D204)","v":201}]
[null,null,null,{"$f":"IF('06 DAP'!D205=\"\",\"\",'06 DAP'!D205)","v":202}]
[null,null,null,{"$f":"IF('06 DAP'!D206=\"\",\"\",'06 DAP'!D206)","v":203}]
[null,null,null,{"$f":"IF('06 DAP'!D207=\"\",\"\",'06 DAP'!D207)","v":204}]
[null,null,null,{"$f":"IF('06 DAP'!D208=\"\",\"\",'06 DAP'!D208)","v":205}]
[null,null,null,{"$f":"IF('06 DAP'!D209=\"\",\"\",'06 DAP'!D209)","v":206}]
[null,null,null,{"$f":"IF('06 DAP'!D210=\"\",\"\",'06 DAP'!D210)","v":207}]
[null,null,null,{"$f":"IF('06 DAP'!D211=\"\",\"\",'06 DAP'!D211)","v":208}]
[null,null,null,{"$f":"IF('06 DAP'!D212=\"\",\"\",'06 DAP'!D212)","v":209}]
[null,null,null,{"$f":"IF('06 DAP'!D213=\"\",\"\",'06 DAP'!D213)","v":210}]
[null,null,null,{"$f":"IF('06 DAP'!D214=\"\",\"\",'06 DAP'!D214)","v":211}]
[null,null,null,{"$f":"IF('06 DAP'!D215=\"\",\"\",'06 DAP'!D215)","v":212}]
[null,null,null,{"$f":"IF('06 DAP'!D216=\"\",\"\",'06 DAP'!D216)","v":213}]
[null,null,null,{"$f":"IF('06 DAP'!D217=\"\",\"\",'06 DAP'!D217)","v":214}]
[null,null,null,{"$f":"IF('06 DAP'!D218=\"\",\"\",'06 DAP'!D218)","v":215}]
[null,null,null,{"$f":"IF('06 DAP'!D219=\"\",\"\",'06 DAP'!D219)","v":216}]
[null,null,null,{"$f":"IF('06 DAP'!D220=\"\",\"\",'06 DAP'!D220)","v":217}]
[null,null,null,{"$f":"IF('06 DAP'!D221=\"\",\"\",'06 DAP'!D221)","v":218}]
[null,null,null,{"$f":"IF('06 DAP'!D222=\"\",\"\",'06 DAP'!D222)","v":219}]
[null,null,null,{"$f":"IF('06 DAP'!D223=\"\",\"\",'06 DAP'!D223)","v":220}]
[null,null,null,{"$f":"IF('06 DAP'!D224=\"\",\"\",'06 DAP'!D224)","v":221}]
[null,null,null,{"$f":"IF('06 DAP'!D225=\"\",\"\",'06 DAP'!D225)","v":222}]
[null,null,null,{"$f":"IF('06 DAP'!D226=\"\",\"\",'06 DAP'!D226)","v":223}]
[null,null,null,{"$f":"IF('06 DAP'!D227=\"\",\"\",'06 DAP'!D227)","v":224}]
[null,null,null,{"$f":"IF('06 DAP'!D228=\"\",\"\",'06 DAP'!D228)","v":225}]
[null,null,null,{"$f":"IF('06 DAP'!D229=\"\",\"\",'06 DAP'!D229)","v":226}]
[null,null,null,{"$f":"IF('06 DAP'!D230=\"\",\"\",'06 DAP'!D230)","v":227}]
[null,null,null,{"$f":"IF('06 DAP'!D231=\"\",\"\",'06 DAP'!D231)","v":228}]
[null,null,null,{"$f":"IF('06 DAP'!D232=\"\",\"\",'06 DAP'!D232)","v":229}]
[null,null,null,{"$f":"IF('06 DAP'!D233=\"\",\"\",'06 DAP'!D233)","v":230}]
[null,null,null,{"$f":"IF('06 DAP'!D234=\"\",\"\",'06 DAP'!D234)","v":231}]
[null,null,null,{"$f":"IF('06 DAP'!D235=\"\",\"\",'06 DAP'!D235)","v":232}]
[null,null,null,{"$f":"IF('06 DAP'!D236=\"\",\"\",'06 DAP'!D236)","v":233}]
[null,null,null,{"$f":"IF('06 DAP'!D237=\"\",\"\",'06 DAP'!D237)","v":234}]
[null,null,null,{"$f":"IF('06 DAP'!D238=\"\",\"\",'06 DAP'!D238)","v":235}]
[null,null,null,{"$f":"IF('06 DAP'!D239=\"\",\"\",'06 DAP'!D239)","v":236}]
[null,null,null,{"$f":"IF('06 DAP'!D240=\"\",\"\",'06 DAP'!D240)","v":237}]
[null,null,null,{"$f":"IF('06 DAP'!D241=\"\",\"\",'06 DAP'!D241)","v":238}]
[null,null,null,{"$f":"IF('06 DAP'!D242=\"\",\"\",'06 DAP'!D242)","v":239}]
[null,null,null,{"$f":"IF('06 DAP'!D243=\"\",\"\",'06 DAP'!D243)","v":240}]
[null,null,null,{"$f":"IF('06 DAP'!D244=\"\",\"\",'06 DAP'!D244)","v":241}]
[null,null,null,{"$f":"IF('06 DAP'!D245=\"\",\"\",'06 DAP'!D245)","v":242}]
[null,null,null,{"$f":"IF('06 DAP'!D246=\"\",\"\",'06 DAP'!D246)","v":243}]
[null,null,null,{"$f":"IF('06 DAP'!D247=\"\",\"\",'06 DAP'!D247)","v":244}]
[null,null,null,{"$f":"IF('06 DAP'!D248=\"\",\"\",'06 DAP'!D248)","v":245}]
[null,null,null,{"$f":"IF('06 DAP'!D249=\"\",\"\",'06 DAP'!D249)","v":246}]
[null,null,null,{"$f":"IF('06 DAP'!D250=\"\",\"\",'06 DAP'!D250)","v":247}]
[null,null,null,{"$f":"IF('06 DAP'!D251=\"\",\"\",'06 DAP'!D251)","v":248}]
[null,null,null,{"$f":"IF('06 DAP'!D252=\"\",\"\",'06 DAP'!D252)","v":249}]
[null,null,null,{"$f":"IF('06 DAP'!D253=\"\",\"\",'06 DAP'!D253)","v":250}]
[null,null,null,{"$f":"IF('06 DAP'!D254=\"\",\"\",'06 DAP'!D254)","v":251}]
[null,null,null,{"$f":"IF('06 DAP'!D255=\"\",\"\",'06 DAP'!D255)","v":252}]
[null,null,null,{"$f":"IF('06 DAP'!D256=\"\",\"\",'06 DAP'!D256)","v":253}]
[null,null,null,{"$f":"IF('06 DAP'!D257=\"\",\"\",'06 DAP'!D257)","v":254}]
[null,null,null,{"$f":"IF('06 DAP'!D258=\"\",\"\",'06 DAP'!D258)","v":255}]
[null,null,null,{"$f":"IF('06 DAP'!D259=\"\",\"\",'06 DAP'!D259)","v":256}]
[null,null,null,{"$f":"IF('06 DAP'!D260=\"\",\"\",'06 DAP'!D260)","v":257}]
[null,null,null,{"$f":"IF('06 DAP'!D261=\"\",\"\",'06 DAP'!D261)","v":258}]
[null,null,null,{"$f":"IF('06 DAP'!D262=\"\",\"\",'06 DAP'!D262)","v":259}]
[null,null,null,{"$f":"IF('06 DAP'!D263=\"\",\"\",'06 DAP'!D263)","v":260}]
[null,null,null,{"$f":"IF('06 DAP'!D264=\"\",\"\",'06 DAP'!D264)","v":261}]
[null,null,null,{"$f":"IF('06 DAP'!D265=\"\",\"\",'06 DAP'!D265)","v":262}]
[null,null,null,{"$f":"IF('06 DAP'!D266=\"\",\"\",'06 DAP'!D266)","v":263}]
[null,null,null,{"$f":"IF('06 DAP'!D267=\"\",\"\",'06 DAP'!D267)","v":264}]
[null,null,null,{"$f":"IF('06 DAP'!D268=\"\",\"\",'06 DAP'!D268)","v":265}]
[null,null,null,{"$f":"IF('06 DAP'!D269=\"\",\"\",'06 DAP'!D269)","v":266}]
[null,null,null,{"$f":"IF('06 DAP'!D270=\"\",\"\",'06 DAP'!D270)","v":267}]
[null,null,null,{"$f":"IF('06 DAP'!D271=\"\",\"\",'06 DAP'!D271)","v":268}]
[null,null,null,{"$f":"IF('06 DAP'!D272=\"\",\"\",'06 DAP'!D272)","v":269}]
[null,null,null,{"$f":"IF('06 DAP'!D273=\"\",\"\",'06 DAP'!D273)","v":270}]
[null,null,null,{"$f":"IF('06 DAP'!D274=\"\",\"\",'06 DAP'!D274)","v":271}]
[null,null,null,{"$f":"IF('06 DAP'!D275=\"\",\"\",'06 DAP'!D275)","v":272}]
[null,null,null,{"$f":"IF('06 DAP'!D276=\"\",\"\",'06 DAP'!D276)","v":273}]
[null,null,null,{"$f":"IF('06 DAP'!D277=\"\",\"\",'06 DAP'!D277)","v":274}]
[null,null,null,{"$f":"IF('06 DAP'!D278=\"\",\"\",'06 DAP'!D278)","v":275}]
[null,null,null,{"$f":"IF('06 DAP'!D279=\"\",\"\",'06 DAP'!D279)","v":276}]
[null,null,null,{"$f":"IF('06 DAP'!D280=\"\",\"\",'06 DAP'!D280)","v":277}]
[null,null,null,{"$f":"IF('06 DAP'!D281=\"\",\"\",'06 DAP'!D281)","v":278}]
[null,null,null,{"$f":"IF('06 DAP'!D282=\"\",\"\",'06 DAP'!D282)","v":279}]
[null,null,null,{"$f":"IF('06 DAP'!D283=\"\",\"\",'06 DAP'!D283)","v":280}]
[null,null,null,{"$f":"IF('06 DAP'!D284=\"\",\"\",'06 DAP'!D284)","v":281}]
[null,null,null,{"$f":"IF('06 DAP'!D285=\"\",\"\",'06 DAP'!D285)","v":282}]
[null,null,null,{"$f":"IF('06 DAP'!D286=\"\",\"\",'06 DAP'!D286)","v":283}]
[null,null,null,{"$f":"IF('06 DAP'!D287=\"\",\"\",'06 DAP'!D287)","v":284}]
[null,null,null,{"$f":"IF('06 DAP'!D288=\"\",\"\",'06 DAP'!D288)","v":285}]
[null,null,null,{"$f":"IF('06 DAP'!D289=\"\",\"\",'06 DAP'!D289)","v":286}]
[null,null,null,{"$f":"IF('06 DAP'!D290=\"\",\"\",'06 DAP'!D290)","v":287}]
[null,null,null,{"$f":"IF('06 DAP'!D291=\"\",\"\",'06 DAP'!D291)","v":288}]
[null,null,null,{"$f":"IF('06 DAP'!D292=\"\",\"\",'06 DAP'!D292)","v":289}]
[null,null,null,{"$f":"IF('06 DAP'!D293=\"\",\"\",'06 DAP'!D293)","v":290}]
[null,null,null,{"$f":"IF('06 DAP'!D294=\"\",\"\",'06 DAP'!D294)","v":291}]
[null,null,null,{"$f":"IF('06 DAP'!D295=\"\",\"\",'06 DAP'!D295)","v":292}]
[null,null,null,{"$f":"IF('06 DAP'!D296=\"\",\"\",'06 DAP'!D296)","v":293}]
[null,null,null,{"$f":"IF('06 DAP'!D297=\"\",\"\",'06 DAP'!D297)","v":294}]
[null,null,null,{"$f":"IF('06 DAP'!D298=\"\",\"\",'06 DAP'!D298)","v":295}]
[null,null,null,{"$f":"IF('06 DAP'!D299=\"\",\"\",'06 DAP'!D299)","v":296}]
[null,null,null,{"$f":"IF('06 DAP'!D300=\"\",\"\",'06 DAP'!D300)","v":297}]
[null,null,null,{"$f":"IF('06 DAP'!D301=\"\",\"\",'06 DAP'!D301)","v":298}]
[null,null,null,{"$f":"IF('06 DAP'!D302=\"\",\"\",'06 DAP'!D302)","v":299}]
[null,null,null,{"$f":"IF('06 DAP'!D303=\"\",\"\",'06 DAP'!D303)","v":300}]
[null,null,null,{"$f":"IF('06 DAP'!D304=\"\",\"\",'06 DAP'!D304)","v":301}]
[null,null,null,{"$f":"IF('06 DAP'!D305=\"\",\"\",'06 DAP'!D305)","v":302}]
[null,null,null,{"$f":"IF('06 DAP'!D306=\"\",\"\",'06 DAP'!D306)","v":303}]
[null,null,null,{"$f":"IF('06 DAP'!D307=\"\",\"\",'06 DAP'!D307)","v":304}]
[null,null,null,{"$f":"IF('06 DAP'!D308=\"\",\"\",'06 DAP'!D308)","v":305}]
[null,null,null,{"$f":"IF('06 DAP'!D309=\"\",\"\",'06 DAP'!D309)","v":306}]
[null,null,null,{"$f":"IF('06 DAP'!D310=\"\",\"\",'06 DAP'!D310)","v":307}]
[null,null,null,{"$f":"IF('06 DAP'!D311=\"\",\"\",'06 DAP'!D311)","v":308}]
[null,null,null,{"$f":"IF('06 DAP'!D312=\"\",\"\",'06 DAP'!D312)","v":309}]
[null,null,null,{"$f":"IF('06 DAP'!D313=\"\",\"\",'06 DAP'!D313)","v":310}]
[null,null,null,{"$f":"IF('06 DAP'!D314=\"\",\"\",'06 DAP'!D314)","v":311}]
[null,null,null,{"$f":"IF('06 DAP'!D315=\"\",\"\",'06 DAP'!D315)","v":312}]
[null,null,null,{"$f":"IF('06 DAP'!D316=\"\",\"\",'06 DAP'!D316)","v":313}]
[null,null,null,{"$f":"IF('06 DAP'!D317=\"\",\"\",'06 DAP'!D317)","v":314}]
[null,null,null,{"$f":"IF('06 DAP'!D318=\"\",\"\",'06 DAP'!D318)","v":315}]
[null,null,null,{"$f":"IF('06 DAP'!D319=\"\",\"\",'06 DAP'!D319)","v":316}]
[null,null,null,{"$f":"IF('06 DAP'!D320=\"\",\"\",'06 DAP'!D320)","v":317}]
[null,null,null,{"$f":"IF('06 DAP'!D321=\"\",\"\",'06 DAP'!D321)","v":318}]
[null,null,null,{"$f":"IF('06 DAP'!D322=\"\",\"\",'06 DAP'!D322)","v":319}]
[null,null,null,{"$f":"IF('06 DAP'!D323=\"\",\"\",'06 DAP'!D323)","v":320}]
[null,null,null,{"$f":"IF('06 DAP'!D324=\"\",\"\",'06 DAP'!D324)","v":321}]
[null,null,null,{"$f":"IF('06 DAP'!D325=\"\",\"\",'06 DAP'!D325)","v":322}]
[null,null,null,{"$f":"IF('06 DAP'!D326=\"\",\"\",'06 DAP'!D326)","v":323}]
[null,null,null,{"$f":"IF('06 DAP'!D327=\"\",\"\",'06 DAP'!D327)","v":324}]
[null,null,null,{"$f":"IF('06 DAP'!D328=\"\",\"\",'06 DAP'!D328)","v":325}]
[null,null,null,{"$f":"IF('06 DAP'!D329=\"\",\"\",'06 DAP'!D329)","v":326}]
[null,null,null,{"$f":"IF('06 DAP'!D330=\"\",\"\",'06 DAP'!D330)","v":327}]
[null,null,null,{"$f":"IF('06 DAP'!D331=\"\",\"\",'06 DAP'!D331)","v":328}]
[null,null,null,{"$f":"IF('06 DAP'!D332=\"\",\"\",'06 DAP'!D332)","v":329}]
[null,null,null,{"$f":"IF('06 DAP'!D333=\"\",\"\",'06 DAP'!D333)","v":330}]
[null,null,null,{"$f":"IF('06 DAP'!D334=\"\",\"\",'06 DAP'!D334)","v":331}]
[null,null,null,{"$f":"IF('06 DAP'!D335=\"\",\"\",'06 DAP'!D335)","v":332}]
[null,null,null,{"$f":"IF('06 DAP'!D336=\"\",\"\",'06 DAP'!D336)","v":333}]
[null,null,null,{"$f":"IF('06 DAP'!D337=\"\",\"\",'06 DAP'!D337)","v":334}]
[null,null,null,{"$f":"IF('06 DAP'!D338=\"\",\"\",'06 DAP'!D338)","v":335}]
[null,null,null,{"$f":"IF('06 DAP'!D339=\"\",\"\",'06 DAP'!D339)","v":336}]
[null,null,null,{"$f":"IF('06 DAP'!D340=\"\",\"\",'06 DAP'!D340)","v":337}]
[null,null,null,{"$f":"IF('06 DAP'!D341=\"\",\"\",'06 DAP'!D341)","v":338}]
[null,null,null,{"$f":"IF('06 DAP'!D342=\"\",\"\",'06 DAP'!D342)","v":339}]
[null,null,null,{"$f":"IF('06 DAP'!D343=\"\",\"\",'06 DAP'!D343)","v":340}]
[null,null,null,{"$f":"IF('06 DAP'!D344=\"\",\"\",'06 DAP'!D344)","v":341}]
[null,null,null,{"$f":"IF('06 DAP'!D345=\"\",\"\",'06 DAP'!D345)","v":342}]
[null,null,null,{"$f":"IF('06 DAP'!D346=\"\",\"\",'06 DAP'!D346)","v":343}]
[null,null,null,{"$f":"IF('06 DAP'!D347=\"\",\"\",'06 DAP'!D347)","v":344}]
[null,null,null,{"$f":"IF('06 DAP'!D348=\"\",\"\",'06 DAP'!D348)","v":345}]
[null,null,null,{"$f":"IF('06 DAP'!D349=\"\",\"\",'06 DAP'!D349)","v":346}]
[null,null,null,{"$f":"IF('06 DAP'!D350=\"\",\"\",'06 DAP'!D350)","v":347}]
[null,null,null,{"$f":"IF('06 DAP'!D351=\"\",\"\",'06 DAP'!D351)","v":348}]
[null,null,null,{"$f":"IF('06 DAP'!D352=\"\",\"\",'06 DAP'!D352)","v":349}]
[null,null,null,{"$f":"IF('06 DAP'!D353=\"\",\"\",'06 DAP'!D353)","v":350}]
[null,null,null,{"$f":"IF('06 DAP'!D354=\"\",\"\",'06 DAP'!D354)","v":351}]
[null,null,null,{"$f":"IF('06 DAP'!D355=\"\",\"\",'06 DAP'!D355)","v":352}]
[null,null,null,{"$f":"IF('06 DAP'!D356=\"\",\"\",'06 DAP'!D356)","v":353}]
[null,null,null,{"$f":"IF('06 DAP'!D357=\"\",\"\",'06 DAP'!D357)","v":354}]
[null,null,null,{"$f":"IF('06 DAP'!D358=\"\",\"\",'06 DAP'!D358)","v":355}]
[null,null,null,{"$f":"IF('06 DAP'!D359=\"\",\"\",'06 DAP'!D359)","v":356}]
[null,null,null,{"$f":"IF('06 DAP'!D360=\"\",\"\",'06 DAP'!D360)","v":357}]
[null,null,null,{"$f":"IF('06 DAP'!D361=\"\",\"\",'06 DAP'!D361)","v":358}]
[null,null,null,{"$f":"IF('06 DAP'!D362=\"\",\"\",'06 DAP'!D362)","v":359}]
[null,null,null,{"$f":"IF('06 DAP'!D363=\"\",\"\",'06 DAP'!D363)","v":360}]
[null,null,null,{"$f":"IF('06 DAP'!D364=\"\",\"\",'06 DAP'!D364)","v":361}]
[null,null,null,{"$f":"IF('06 DAP'!D365=\"\",\"\",'06 DAP'!D365)","v":362}]
[null,null,null,{"$f":"IF('06 DAP'!D366=\"\",\"\",'06 DAP'!D366)","v":363}]
[null,null,null,{"$f":"IF('06 DAP'!D367=\"\",\"\",'06 DAP'!D367)","v":364}]
[null,null,null,{"$f":"IF('06 DAP'!D368=\"\",\"\",'06 DAP'!D368)","v":365}]
[null,null,null,{"$f":"IF('06 DAP'!D369=\"\",\"\",'06 DAP'!D369)","v":366}]
[null,null,null,{"$f":"IF('06 DAP'!D370=\"\",\"\",'06 DAP'!D370)","v":367}]
[null,null,null,{"$f":"IF('06 DAP'!D371=\"\",\"\",'06 DAP'!D371)","v":368}]
[null,null,null,{"$f":"IF('06 DAP'!D372=\"\",\"\",'06 DAP'!D372)","v":369}]
[null,null,null,{"$f":"IF('06 DAP'!D373=\"\",\"\",'06 DAP'!D373)","v":370}]
[null,null,null,{"$f":"IF('06 DAP'!D374=\"\",\"\",'06 DAP'!D374)","v":371}]
[null,null,null,{"$f":"IF('06 DAP'!D375=\"\",\"\",'06 DAP'!D375)","v":372}]
[null,null,null,{"$f":"IF('06 DAP'!D376=\"\",\"\",'06 DAP'!D376)","v":373}]
[null,null,null,{"$f":"IF('06 DAP'!D377=\"\",\"\",'06 DAP'!D377)","v":374}]
[null,null,null,{"$f":"IF('06 DAP'!D378=\"\",\"\",'06 DAP'!D378)","v":375}]
[null,null,null,{"$f":"IF('06 DAP'!D379=\"\",\"\",'06 DAP'!D379)","v":376}]
[null,null,null,{"$f":"IF('06 DAP'!D380=\"\",\"\",'06 DAP'!D380)","v":377}]
[null,null,null,{"$f":"IF('06 DAP'!D381=\"\",\"\",'06 DAP'!D381)","v":378}]
[null,null,null,{"$f":"IF('06 DAP'!D382=\"\",\"\",'06 DAP'!D382)","v":379}]
[null,null,null,{"$f":"IF('06 DAP'!D383=\"\",\"\",'06 DAP'!D383)","v":380}]
[null,null,null,{"$f":"IF('06 DAP'!D384=\"\",\"\",'06 DAP'!D384)","v":381}]
[null,null,null,{"$f":"IF('06 DAP'!D385=\"\",\"\",'06 DAP'!D385)","v":382}]
[null,null,null,{"$f":"IF('06 DAP'!D386=\"\",\"\",'06 DAP'!D386)","v":383}]
[null,null,null,{"$f":"IF('06 DAP'!D387=\"\",\"\",'06 DAP'!D387)","v":384}]
[null,null,null,{"$f":"IF('06 DAP'!D388=\"\",\"\",'06 DAP'!D388)","v":385}]
[null,null,null,{"$f":"IF('06 DAP'!D389=\"\",\"\",'06 DAP'!D389)","v":386}]
[null,null,null,{"$f":"IF('06 DAP'!D390=\"\",\"\",'06 DAP'!D390)","v":387}]
[null,null,null,{"$f":"IF('06 DAP'!D391=\"\",\"\",'06 DAP'!D391)","v":388}]
[null,null,null,{"$f":"IF('06 DAP'!D392=\"\",\"\",'06 DAP'!D392)","v":389}]
[null,null,null,{"$f":"IF('06 DAP'!D393=\"\",\"\",'06 DAP'!D393)","v":390}]
[null,null,null,{"$f":"IF('06 DAP'!D394=\"\",\"\",'06 DAP'!D394)","v":391}]
[null,null,null,{"$f":"IF('06 DAP'!D395=\"\",\"\",'06 DAP'!D395)","v":392}]
[null,null,null,{"$f":"IF('06 DAP'!D396=\"\",\"\",'06 DAP'!D396)","v":393}]
[null,null,null,{"$f":"IF('06 DAP'!D397=\"\",\"\",'06 DAP'!D397)","v":394}]
[null,null,null,{"$f":"IF('06 DAP'!D398=\"\",\"\",'06 DAP'!D398)","v":395}]
[null,null,null,{"$f":"IF('06 DAP'!D399=\"\",\"\",'06 DAP'!D399)","v":396}]
[null,null,null,{"$f":"IF('06 DAP'!D400=\"\",\"\",'06 DAP'!D400)","v":397}]
[null,null,null,{"$f":"IF('06 DAP'!D401=\"\",\"\",'06 DAP'!D401)","v":398}]
[null,null,null,{"$f":"IF('06 DAP'!D402=\"\",\"\",'06 DAP'!D402)","v":399}]
[null,null,null,{"$f":"IF('06 DAP'!D403=\"\",\"\",'06 DAP'!D403)","v":400}]
[null,null,null,{"$f":"IF('06 DAP'!D404=\"\",\"\",'06 DAP'!D404)","v":401}]
[null,null,null,{"$f":"IF('06 DAP'!D405=\"\",\"\",'06 DAP'!D405)","v":402}]
[null,null,null,{"$f":"IF('06 DAP'!D406=\"\",\"\",'06 DAP'!D406)","v":403}]
[null,null,null,{"$f":"IF('06 DAP'!D407=\"\",\"\",'06 DAP'!D407)","v":404}]
[null,null,null,{"$f":"IF('06 DAP'!D408=\"\",\"\",'06 DAP'!D408)","v":405}]
[null,null,null,{"$f":"IF('06 DAP'!D409=\"\",\"\",'06 DAP'!D409)","v":406}]
[null,null,null,{"$f":"IF('06 DAP'!D410=\"\",\"\",'06 DAP'!D410)","v":407}]
[null,null,null,{"$f":"IF('06 DAP'!D411=\"\",\"\",'06 DAP'!D411)","v":408}]
[null,null,null,{"$f":"IF('06 DAP'!D412=\"\",\"\",'06 DAP'!D412)","v":409}]
[null,null,null,{"$f":"IF('06 DAP'!D413=\"\",\"\",'06 DAP'!D413)","v":410}]
[null,null,null,{"$f":"IF('06 DAP'!D414=\"\",\"\",'06 DAP'!D414)","v":411}]
[null,null,null,{"$f":"IF('06 DAP'!D415=\"\",\"\",'06 DAP'!D415)","v":412}]
[null,null,null,{"$f":"IF('06 DAP'!D416=\"\",\"\",'06 DAP'!D416)","v":413}]
[null,null,null,{"$f":"IF('06 DAP'!D417=\"\",\"\",'06 DAP'!D417)","v":414}]
[null,null,null,{"$f":"IF('06 DAP'!D418=\"\",\"\",'06 DAP'!D418)","v":415}]
[null,null,null,{"$f":"IF('06 DAP'!D419=\"\",\"\",'06 DAP'!D419)","v":416}]
[null,null,null,{"$f":"IF('06 DAP'!D420=\"\",\"\",'06 DAP'!D420)","v":417}]
[null,null,null,{"$f":"IF('06 DAP'!D421=\"\",\"\",'06 DAP'!D421)","v":418}]
[null,null,null,{"$f":"IF('06 DAP'!D422=\"\",\"\",'06 DAP'!D422)","v":419}]
[null,null,null,{"$f":"IF('06 DAP'!D423=\"\",\"\",'06 DAP'!D423)","v":420}]
[null,null,null,{"$f":"IF('06 DAP'!D424=\"\",\"\",'06 DAP'!D424)","v":421}]
[null,null,null,{"$f":"IF('06 DAP'!D425=\"\",\"\",'06 DAP'!D425)","v":422}]
[null,null,null,{"$f":"IF('06 DAP'!D426=\"\",\"\",'06 DAP'!D426)","v":423}]
[null,null,null,{"$f":"IF('06 DAP'!D427=\"\",\"\",'06 DAP'!D427)","v":424}]
[null,null,null,{"$f":"IF('06 DAP'!D428=\"\",\"\",'06 DAP'!D428)","v":425}]
[null,null,null,{"$f":"IF('06 DAP'!D429=\"\",\"\",'06 DAP'!D429)","v":426}]
[null,null,null,{"$f":"IF('06 DAP'!D430=\"\",\"\",'06 DAP'!D430)","v":427}]
[null,null,null,{"$f":"IF('06 DAP'!D431=\"\",\"\",'06 DAP'!D431)","v":428}]
[null,null,null,{"$f":"IF('06 DAP'!D432=\"\",\"\",'06 DAP'!D432)","v":429}]
[null,null,null,{"$f":"IF('06 DAP'!D433=\"\",\"\",'06 DAP'!D433)","v":430}]
[null,null,null,{"$f":"IF('06 DAP'!D434=\"\",\"\",'06 DAP'!D434)","v":431}]
[null,null,null,{"$f":"IF('06 DAP'!D435=\"\",\"\",'06 DAP'!D435)","v":432}]
[null,null,null,{"$f":"IF('06 DAP'!D436=\"\",\"\",'06 DAP'!D436)","v":433}]
[null,null,null,{"$f":"IF('06 DAP'!D437=\"\",\"\",'06 DAP'!D437)","v":434}]
[null,null,null,{"$f":"IF('06 DAP'!D438=\"\",\"\",'06 DAP'!D438)","v":435}]
[null,null,null,{"$f":"IF('06 DAP'!D439=\"\",\"\",'06 DAP'!D439)","v":436}]
[null,null,null,{"$f":"IF('06 DAP'!D440=\"\",\"\",'06 DAP'!D440)","v":437}]
[null,null,null,{"$f":"IF('06 DAP'!D441=\"\",\"\",'06 DAP'!D441)","v":438}]
[null,null,null,{"$f":"IF('06 DAP'!D442=\"\",\"\",'06 DAP'!D442)","v":439}]
[null,null,null,{"$f":"IF('06 DAP'!D443=\"\",\"\",'06 DAP'!D443)","v":440}]
[null,null,null,{"$f":"IF('06 DAP'!D444=\"\",\"\",'06 DAP'!D444)","v":441}]
[null,null,null,{"$f":"IF('06 DAP'!D445=\"\",\"\",'06 DAP'!D445)","v":442}]
[null,null,null,{"$f":"IF('06 DAP'!D446=\"\",\"\",'06 DAP'!D446)","v":443}]
[null,null,null,{"$f":"IF('06 DAP'!D447=\"\",\"\",'06 DAP'!D447)","v":444}]
[null,null,null,{"$f":"IF('06 DAP'!D448=\"\",\"\",'06 DAP'!D448)","v":445}]
[null,null,null,{"$f":"IF('06 DAP'!D449=\"\",\"\",'06 DAP'!D449)","v":446}]
[null,null,null,{"$f":"IF('06 DAP'!D450=\"\",\"\",'06 DAP'!D450)","v":447}]
[null,null,null,{"$f":"IF('06 DAP'!D451=\"\",\"\",'06 DAP'!D451)","v":448}]
[null,null,null,{"$f":"IF('06 DAP'!D452=\"\",\"\",'06 DAP'!D452)","v":449}]
[null,null,null,{"$f":"IF('06 DAP'!D453=\"\",\"\",'06 DAP'!D453)","v":450}]
[null,null,null,{"$f":"IF('06 DAP'!D454=\"\",\"\",'06 DAP'!D454)","v":451}]
[null,null,null,{"$f":"IF('06 DAP'!D455=\"\",\"\",'06 DAP'!D455)","v":452}]
[null,null,null,{"$f":"IF('06 DAP'!D456=\"\",\"\",'06 DAP'!D456)","v":453}]
[null,null,null,{"$f":"IF('06 DAP'!D457=\"\",\"\",'06 DAP'!D457)","v":454}]
[null,null,null,{"$f":"IF('06 DAP'!D458=\"\",\"\",'06 DAP'!D458)","v":455}]
[null,null,null,{"$f":"IF('06 DAP'!D459=\"\",\"\",'06 DAP'!D459)","v":456}]
[null,null,null,{"$f":"IF('06 DAP'!D460=\"\",\"\",'06 DAP'!D460)","v":457}]
[null,null,null,{"$f":"IF('06 DAP'!D461=\"\",\"\",'06 DAP'!D461)","v":458}]
[null,null,null,{"$f":"IF('06 DAP'!D462=\"\",\"\",'06 DAP'!D462)","v":459}]
[null,null,null,{"$f":"IF('06 DAP'!D463=\"\",\"\",'06 DAP'!D463)","v":460}]
[null,null,null,{"$f":"IF('06 DAP'!D464=\"\",\"\",'06 DAP'!D464)","v":461}]
[null,null,null,{"$f":"IF('06 DAP'!D465=\"\",\"\",'06 DAP'!D465)","v":462}]
[null,null,null,{"$f":"IF('06 DAP'!D466=\"\",\"\",'06 DAP'!D466)","v":463}]
[null,null,null,{"$f":"IF('06 DAP'!D467=\"\",\"\",'06 DAP'!D467)","v":464}]
[null,null,null,{"$f":"IF('06 DAP'!D468=\"\",\"\",'06 DAP'!D468)","v":465}]
[null,null,null,{"$f":"IF('06 DAP'!D469=\"\",\"\",'06 DAP'!D469)","v":466}]
[null,null,null,{"$f":"IF('06 DAP'!D470=\"\",\"\",'06 DAP'!D470)","v":467}]
[null,null,null,{"$f":"IF('06 DAP'!D471=\"\",\"\",'06 DAP'!D471)","v":468}]
[null,null,null,{"$f":"IF('06 DAP'!D472=\"\",\"\",'06 DAP'!D472)","v":469}]
[null,null,null,{"$f":"IF('06 DAP'!D473=\"\",\"\",'06 DAP'!D473)","v":470}]
[null,null,null,{"$f":"IF('06 DAP'!D474=\"\",\"\",'06 DAP'!D474)","v":471}]
[null,null,null,{"$f":"IF('06 DAP'!D475=\"\",\"\",'06 DAP'!D475)","v":472}]
[null,null,null,{"$f":"IF('06 DAP'!D476=\"\",\"\",'06 DAP'!D476)","v":473}]
[null,null,null,{"$f":"IF('06 DAP'!D477=\"\",\"\",'06 DAP'!D477)","v":474}]
[null,null,null,{"$f":"IF('06 DAP'!D478=\"\",\"\",'06 DAP'!D478)","v":475}]
[null,null,null,{"$f":"IF('06 DAP'!D479=\"\",\"\",'06 DAP'!D479)","v":476}]
[null,null,null,{"$f":"IF('06 DAP'!D480=\"\",\"\",'06 DAP'!D480)","v":477}]
[null,null,null,{"$f":"IF('06 DAP'!D481=\"\",\"\",'06 DAP'!D481)","v":478}]
[null,null,null,{"$f":"IF('06 DAP'!D482=\"\",\"\",'06 DAP'!D482)","v":479}]
[null,null,null,{"$f":"IF('06 DAP'!D483=\"\",\"\",'06 DAP'!D483)","v":480}]
[null,null,null,{"$f":"IF('06 DAP'!D484=\"\",\"\",'06 DAP'!D484)","v":481}]
[null,null,null,{"$f":"IF('06 DAP'!D485=\"\",\"\",'06 DAP'!D485)","v":482}]
[null,null,null,{"$f":"IF('06 DAP'!D486=\"\",\"\",'06 DAP'!D486)","v":483}]
[null,null,null,{"$f":"IF('06 DAP'!D487=\"\",\"\",'06 DAP'!D487)","v":484}]
[null,null,null,{"$f":"IF('06 DAP'!D488=\"\",\"\",'06 DAP'!D488)","v":485}]
[null,null,null,{"$f":"IF('06 DAP'!D489=\"\",\"\",'06 DAP'!D489)","v":486}]
[null,null,null,{"$f":"IF('06 DAP'!D490=\"\",\"\",'06 DAP'!D490)","v":487}]
[null,null,null,{"$f":"IF('06 DAP'!D491=\"\",\"\",'06 DAP'!D491)","v":488}]
[null,null,null,{"$f":"IF('06 DAP'!D492=\"\",\"\",'06 DAP'!D492)","v":489}]
[null,null,null,{"$f":"IF('06 DAP'!D493=\"\",\"\",'06 DAP'!D493)","v":490}]
[null,null,null,{"$f":"IF('06 DAP'!D494=\"\",\"\",'06 DAP'!D494)","v":491}]
[null,null,null,{"$f":"IF('06 DAP'!D495=\"\",\"\",'06 DAP'!D495)","v":492}]
[null,null,null,{"$f":"IF('06 DAP'!D496=\"\",\"\",'06 DAP'!D496)","v":493}]
[null,null,null,{"$f":"IF('06 DAP'!D497=\"\",\"\",'06 DAP'!D497)","v":494}]
[null,null,null,{"$f":"IF('06 DAP'!D498=\"\",\"\",'06 DAP'!D498)","v":495}]
[null,null,null,{"$f":"IF('06 DAP'!D499=\"\",\"\",'06 DAP'!D499)","v":496}]
[null,null,null,{"$f":"IF('06 DAP'!D500=\"\",\"\",'06 DAP'!D500)","v":497}]
[null,null,null,{"$f":"IF('06 DAP'!D501=\"\",\"\",'06 DAP'!D501)","v":498}]
[null,null,null,{"$f":"IF('06 DAP'!D502=\"\",\"\",'06 DAP'!D502)","v":499}]
[null,null,null,{"$f":"IF('06 DAP'!D503=\"\",\"\",'06 DAP'!D503)","v":500}]
[null,null,null,{"$f":"IF('06 DAP'!D504=\"\",\"\",'06 DAP'!D504)","v":501}]
[null,null,null,"-"]
[null,null,null,{"$f":"IF('06 DAP'!D506=\"\",\"\",'06 DAP'!D506)","v":""}]
[null,null,null,{"$f":"IF('06 DAP'!D507=\"\",\"\",'06 DAP'!D507)","v":""}]
[null,null,null,{"$f":"IF('06 DAP'!D508=\"\",\"\",'06 DAP'!D508)","v":""}]
[null,null,null,{"$f":"IF('06 DAP'!D509=\"\",\"\",'06 DAP'!D509)","v":""}]
[null,null,null,{"$f":"IF('06 DAP'!D510=\"\",\"\",'06 DAP'!D510)","v":""}]
[null,null,null,{"$f":"IF('06 DAP'!D511=\"\",\"\",'06 DAP'!D511)","v":""}]
[null,null,null,{"$f":"IF('06 DAP'!D512=\"\",\"\",'06 DAP'!D512)","v":""}]
[null,null,null,{"$f":"IF('06 DAP'!D513=\"\",\"\",'06 DAP'!D513)","v":""}]
[null,null,null,{"$f":"IF('06 DAP'!D514=\"\",\"\",'06 DAP'!D514)","v":""}]
[null,null,null,{"$f":"IF('06 DAP'!D515=\"\",\"\",'06 DAP'!D515)","v":""}]
[null,null,null,{"$f":"IF('06 DAP'!D516=\"\",\"\",'06 DAP'!D516)","v":""}]
[null,null,null,{"$f":"IF('06 DAP'!D517=\"\",\"\",'06 DAP'!D517)","v":""}]
[null,null,null,{"$f":"IF('06 DAP'!D518=\"\",\"\",'06 DAP'!D518)","v":""}]
[null,null,null,{"$f":"IF('06 DAP'!D519=\"\",\"\",'06 DAP'!D519)","v":""}]
[null,null,null,{"$f":"IF('06 DAP'!D520=\"\",\"\",'06 DAP'!D520)","v":""}]
[null,null,null,{"$f":"IF('06 DAP'!D521=\"\",\"\",'06 DAP'!D521)","v":""}]
[null,null,null,{"$f":"IF('06 DAP'!D522=\"\",\"\",'06 DAP'!D522)","v":""}]
[null,null,null,{"$f":"IF('06 DAP'!D523=\"\",\"\",'06 DAP'!D523)","v":""}]
[null,null,null,{"$f":"IF('06 DAP'!D524=\"\",\"\",'06 DAP'!D524)","v":""}]
[null,null,null,{"$f":"IF('06 DAP'!D525=\"\",\"\",'06 DAP'!D525)","v":""}]
[null,null,null,{"$f":"IF('06 DAP'!D526=\"\",\"\",'06 DAP'!D526)","v":""}]
[null,null,null,{"$f":"IF('06 DAP'!D527=\"\",\"\",'06 DAP'!D527)","v":""}]
[null,null,null,{"$f":"IF('06 DAP'!D528=\"\",\"\",'06 DAP'!D528)","v":""}]
[null,null,null,{"$f":"IF('06 DAP'!D529=\"\",\"\",'06 DAP'!D529)","v":""}]
[null,null,null,{"$f":"IF('06 DAP'!D530=\"\",\"\",'06 DAP'!D530)","v":""}]
[null,null,null,{"$f":"IF('06 DAP'!D531=\"\",\"\",'06 DAP'!D531)","v":""}]
[null,null,null,{"$f":"IF('06 DAP'!D532=\"\",\"\",'06 DAP'!D532)","v":""}]
[null,null,null,{"$f":"IF('06 DAP'!D533=\"\",\"\",'06 DAP'!D533)","v":""}]
[null,null,null,{"$f":"IF('06 DAP'!D534=\"\",\"\",'06 DAP'!D534)","v":""}]
[null,null,null,{"$f":"IF('06 DAP'!D535=\"\",\"\",'06 DAP'!D535)","v":""}]
[null,null,null,{"$f":"IF('06 DAP'!D536=\"\",\"\",'06 DAP'!D536)","v":""}]
[null,null,null,{"$f":"IF('06 DAP'!D537=\"\",\"\",'06 DAP'!D537)","v":""}]
[null,null,null,{"$f":"IF('06 DAP'!D538=\"\",\"\",'06 DAP'!D538)","v":""}]
[null,null,null,{"$f":"IF('06 DAP'!D539=\"\",\"\",'06 DAP'!D539)","v":""}]
[null,null,null,{"$f":"IF('06 DAP'!D540=\"\",\"\",'06 DAP'!D540)","v":""}]
[null,null,null,{"$f":"IF('06 DAP'!D541=\"\",\"\",'06 DAP'!D541)","v":""}]
[null,null,null,{"$f":"IF('06 DAP'!D542=\"\",\"\",'06 DAP'!D542)","v":""}]
[null,null,null,{"$f":"IF('06 DAP'!D543=\"\",\"\",'06 DAP'!D543)","v":""}]
[null,null,null,{"$f":"IF('06 DAP'!D544=\"\",\"\",'06 DAP'!D544)","v":""}]
[null,null,null,{"$f":"IF('06 DAP'!D545=\"\",\"\",'06 DAP'!D545)","v":""}]
[null,null,null,{"$f":"IF('06 DAP'!D546=\"\",\"\",'06 DAP'!D546)","v":""}]
[null,null,null,{"$f":"IF('06 DAP'!D547=\"\",\"\",'06 DAP'!D547)","v":""}]
[null,null,null,{"$f":"IF('06 DAP'!D548=\"\",\"\",'06 DAP'!D548)","v":""}]
[null,null,null,{"$f":"IF('06 DAP'!D549=\"\",\"\",'06 DAP'!D549)","v":""}]
[null,null,null,{"$f":"IF('06 DAP'!D550=\"\",\"\",'06 DAP'!D550)","v":""}]
[null,null,null,{"$f":"IF('06 DAP'!D551=\"\",\"\",'06 DAP'!D551)","v":""}]
[null,null,null,{"$f":"IF('06 DAP'!D552=\"\",\"\",'06 DAP'!D552)","v":""}]
[null,null,null,{"$f":"IF('06 DAP'!D553=\"\",\"\",'06 DAP'!D553)","v":""}]
[null,null,null,{"$f":"IF('06 DAP'!D554=\"\",\"\",'06 DAP'!D554)","v":""}]
[null,null,null,{"$f":"IF('06 DAP'!D555=\"\",\"\",'06 DAP'!D555)","v":""}]
[null,null,null,{"$f":"IF('06 DAP'!D556=\"\",\"\",'06 DAP'!D556)","v":""}]
[null,null,null,{"$f":"IF('06 DAP'!D557=\"\",\"\",'06 DAP'!D557)","v":""}]
[null,null,null,{"$f":"IF('06 DAP'!D558=\"\",\"\",'06 DAP'!D558)","v":""}]
[null,null,null,{"$f":"IF('06 DAP'!D559=\"\",\"\",'06 DAP'!D559)","v":""}]
[null,null,null,{"$f":"IF('06 DAP'!D560=\"\",\"\",'06 DAP'!D560)","v":""}]
[null,null,null,{"$f":"IF('06 DAP'!D561=\"\",\"\",'06 DAP'!D561)","v":""}]
[null,null,null,{"$f":"IF('06 DAP'!D562=\"\",\"\",'06 DAP'!D562)","v":""}]
[null,null,null,{"$f":"IF('06 DAP'!D563=\"\",\"\",'06 DAP'!D563)","v":""}]
[null,null,null,{"$f":"IF('06 DAP'!D564=\"\",\"\",'06 DAP'!D564)","v":""}]
[null,null,null,{"$f":"IF('06 DAP'!D565=\"\",\"\",'06 DAP'!D565)","v":""}]
[null,null,null,{"$f":"IF('06 DAP'!D566=\"\",\"\",'06 DAP'!D566)","v":""}]
[null,null,null,{"$f":"IF('06 DAP'!D567=\"\",\"\",'06 DAP'!D567)","v":""}]
[null,null,null,{"$f":"IF('06 DAP'!D568=\"\",\"\",'06 DAP'!D568)","v":""}]
[null,null,null,{"$f":"IF('06 DAP'!D569=\"\",\"\",'06 DAP'!D569)","v":""}]
[null,null,null,{"$f":"IF('06 DAP'!D570=\"\",\"\",'06 DAP'!D570)","v":""}]
[null,null,null,{"$f":"IF('06 DAP'!D571=\"\",\"\",'06 DAP'!D571)","v":""}]
[null,null,null,{"$f":"IF('06 DAP'!D572=\"\",\"\",'06 DAP'!D572)","v":""}]
[null,null,null,{"$f":"IF('06 DAP'!D573=\"\",\"\",'06 DAP'!D573)","v":""}]
[null,null,null,{"$f":"IF('06 DAP'!D574=\"\",\"\",'06 DAP'!D574)","v":""}]
[null,null,null,{"$f":"IF('06 DAP'!D575=\"\",\"\",'06 DAP'!D575)","v":""}]
[null,null,null,{"$f":"IF('06 DAP'!D576=\"\",\"\",'06 DAP'!D576)","v":""}]
[null,null,null,{"$f":"IF('06 DAP'!D577=\"\",\"\",'06 DAP'!D577)","v":""}]
[null,null,null,{"$f":"IF('06 DAP'!D578=\"\",\"\",'06 DAP'!D578)","v":""}]
[null,null,null,{"$f":"IF('06 DAP'!D579=\"\",\"\",'06 DAP'!D579)","v":""}]
[null,null,null,{"$f":"IF('06 DAP'!D580=\"\",\"\",'06 DAP'!D580)","v":""}]
[null,null,null,{"$f":"IF('06 DAP'!D581=\"\",\"\",'06 DAP'!D581)","v":""}]
[null,null,null,{"$f":"IF('06 DAP'!D582=\"\",\"\",'06 DAP'!D582)","v":""}]
[null,null,null,{"$f":"IF('06 DAP'!D583=\"\",\"\",'06 DAP'!D583)","v":""}]
[null,null,null,{"$f":"IF('06 DAP'!D584=\"\",\"\",'06 DAP'!D584)","v":""}]
[null,null,null,{"$f":"IF('06 DAP'!D585=\"\",\"\",'06 DAP'!D585)","v":""}]
[null,null,null,{"$f":"IF('06 DAP'!D586=\"\",\"\",'06 DAP'!D586)","v":""}]
[null,null,null,{"$f":"IF('06 DAP'!D587=\"\",\"\",'06 DAP'!D587)","v":""}]
[null,null,null,{"$f":"IF('06 DAP'!D588=\"\",\"\",'06 DAP'!D588)","v":""}]
[null,null,null,{"$f":"IF('06 DAP'!D589=\"\",\"\",'06 DAP'!D589)","v":""}]
[null,null,null,{"$f":"IF('06 DAP'!D590=\"\",\"\",'06 DAP'!D590)","v":""}]
[null,null,null,{"$f":"IF('06 DAP'!D591=\"\",\"\",'06 DAP'!D591)","v":""}]
[null,null,null,{"$f":"IF('06 DAP'!D592=\"\",\"\",'06 DAP'!D592)","v":""}]
[null,null,null,{"$f":"IF('06 DAP'!D593=\"\",\"\",'06 DAP'!D593)","v":""}]
[null,null,null,{"$f":"IF('06 DAP'!D594=\"\",\"\",'06 DAP'!D594)","v":""}]
[null,null,null,{"$f":"IF('06 DAP'!D595=\"\",\"\",'06 DAP'!D595)","v":""}]
[null,null,null,{"$f":"IF('06 DAP'!D596=\"\",\"\",'06 DAP'!D596)","v":""}]
[null,null,null,{"$f":"IF('06 DAP'!D597=\"\",\"\",'06 DAP'!D597)","v":""}]
[null,null,null,{"$f":"IF('06 DAP'!D598=\"\",\"\",'06 DAP'!D598)","v":""}]
[null,null,null,{"$f":"IF('06 DAP'!D599=\"\",\"\",'06 DAP'!D599)","v":""}]
[null,null,null,{"$f":"IF('06 DAP'!D600=\"\",\"\",'06 DAP'!D600)","v":""}]
[null,null,null,{"$f":"IF('06 DAP'!D601=\"\",\"\",'06 DAP'!D601)","v":""}]
[null,null,null,{"$f":"IF('06 DAP'!D602=\"\",\"\",'06 DAP'!D602)","v":""}]
[null,null,null,{"$f":"IF('06 DAP'!D603=\"\",\"\",'06 DAP'!D603)","v":""}]
[null,null,null,{"$f":"IF('06 DAP'!D604=\"\",\"\",'06 DAP'!D604)","v":""}]
[null,null,null,{"$f":"IF('06 DAP'!D605=\"\",\"\",'06 DAP'!D605)","v":""}]
[null,null,null,{"$f":"IF('06 DAP'!D606=\"\",\"\",'06 DAP'!D606)","v":""}]
[null,null,null,{"$f":"IF('06 DAP'!D607=\"\",\"\",'06 DAP'!D607)","v":""}]
[null,null,null,{"$f":"IF('06 DAP'!D608=\"\",\"\",'06 DAP'!D608)","v":""}]
[null,null,null,{"$f":"IF('06 DAP'!D609=\"\",\"\",'06 DAP'!D609)","v":""}]
[null,null,null,{"$f":"IF('06 DAP'!D610=\"\",\"\",'06 DAP'!D610)","v":""}]
[null,null,null,{"$f":"IF('06 DAP'!D611=\"\",\"\",'06 DAP'!D611)","v":""}]
[null,null,null,{"$f":"IF('06 DAP'!D612=\"\",\"\",'06 DAP'!D612)","v":""}]
[null,null,null,{"$f":"IF('06 DAP'!D613=\"\",\"\",'06 DAP'!D613)","v":""}]
[null,null,null,{"$f":"IF('06 DAP'!D614=\"\",\"\",'06 DAP'!D614)","v":""}]
[null,null,null,{"$f":"IF('06 DAP'!D615=\"\",\"\",'06 DAP'!D615)","v":""}]
[null,null,null,{"$f":"IF('06 DAP'!D616=\"\",\"\",'06 DAP'!D616)","v":""}]
[null,null,null,{"$f":"IF('06 DAP'!D617=\"\",\"\",'06 DAP'!D617)","v":""}]
[null,null,null,{"$f":"IF('06 DAP'!D618=\"\",\"\",'06 DAP'!D618)","v":""}]
[null,null,null,{"$f":"IF('06 DAP'!D619=\"\",\"\",'06 DAP'!D619)","v":""}]
[null,null,null,{"$f":"IF('06 DAP'!D620=\"\",\"\",'06 DAP'!D620)","v":""}]
[null,null,null,{"$f":"IF('06 DAP'!D621=\"\",\"\",'06 DAP'!D621)","v":""}]
[null,null,null,{"$f":"IF('06 DAP'!D622=\"\",\"\",'06 DAP'!D622)","v":""}]
[null,null,null,{"$f":"IF('06 DAP'!D623=\"\",\"\",'06 DAP'!D623)","v":""}]
[null,null,null,{"$f":"IF('06 DAP'!D624=\"\",\"\",'06 DAP'!D624)","v":""}]
[null,null,null,{"$f":"IF('06 DAP'!D625=\"\",\"\",'06 DAP'!D625)","v":""}]
[null,null,null,{"$f":"IF('06 DAP'!D626=\"\",\"\",'06 DAP'!D626)","v":""}]
[null,null,null,{"$f":"IF('06 DAP'!D627=\"\",\"\",'06 DAP'!D627)","v":""}]
[null,null,null,{"$f":"IF('06 DAP'!D628=\"\",\"\",'06 DAP'!D628)","v":""}]
[null,null,null,{"$f":"IF('06 DAP'!D629=\"\",\"\",'06 DAP'!D629)","v":""}]
[null,null,null,{"$f":"IF('06 DAP'!D630=\"\",\"\",'06 DAP'!D630)","v":""}]
[null,null,null,{"$f":"IF('06 DAP'!D631=\"\",\"\",'06 DAP'!D631)","v":""}]
[null,null,null,{"$f":"IF('06 DAP'!D632=\"\",\"\",'06 DAP'!D632)","v":""}]
[null,null,null,{"$f":"IF('06 DAP'!D633=\"\",\"\",'06 DAP'!D633)","v":""}]
[null,null,null,{"$f":"IF('06 DAP'!D634=\"\",\"\",'06 DAP'!D634)","v":""}]
[null,null,null,{"$f":"IF('06 DAP'!D635=\"\",\"\",'06 DAP'!D635)","v":""}]
[null,null,null,{"$f":"IF('06 DAP'!D636=\"\",\"\",'06 DAP'!D636)","v":""}]
[null,null,null,{"$f":"IF('06 DAP'!D637=\"\",\"\",'06 DAP'!D637)","v":""}]
[null,null,null,{"$f":"IF('06 DAP'!D638=\"\",\"\",'06 DAP'!D638)","v":""}]
[null,null,null,{"$f":"IF('06 DAP'!D639=\"\",\"\",'06 DAP'!D639)","v":""}]
[null,null,null,{"$f":"IF('06 DAP'!D640=\"\",\"\",'06 DAP'!D640)","v":""}]
[null,null,null,{"$f":"IF('06 DAP'!D641=\"\",\"\",'06 DAP'!D641)","v":""}]
[null,null,null,{"$f":"IF('06 DAP'!D642=\"\",\"\",'06 DAP'!D642)","v":""}]
[null,null,null,{"$f":"IF('06 DAP'!D643=\"\",\"\",'06 DAP'!D643)","v":""}]
[null,null,null,{"$f":"IF('06 DAP'!D644=\"\",\"\",'06 DAP'!D644)","v":""}]
[null,null,null,{"$f":"IF('06 DAP'!D645=\"\",\"\",'06 DAP'!D645)","v":""}]
[null,null,null,{"$f":"IF('06 DAP'!D646=\"\",\"\",'06 DAP'!D646)","v":""}]
[null,null,null,{"$f":"IF('06 DAP'!D647=\"\",\"\",'06 DAP'!D647)","v":""}]
[null,null,null,{"$f":"IF('06 DAP'!D648=\"\",\"\",'06 DAP'!D648)","v":""}]
[null,null,null,{"$f":"IF('06 DAP'!D649=\"\",\"\",'06 DAP'!D649)","v":""}]
[null,null,null,{"$f":"IF('06 DAP'!D650=\"\",\"\",'06 DAP'!D650)","v":""}]
[null,null,null,{"$f":"IF('06 DAP'!D651=\"\",\"\",'06 DAP'!D651)","v":""}]
[null,null,null,{"$f":"IF('06 DAP'!D652=\"\",\"\",'06 DAP'!D652)","v":""}]
[null,null,null,{"$f":"IF('06 DAP'!D653=\"\",\"\",'06 DAP'!D653)","v":""}]
[null,null,null,{"$f":"IF('06 DAP'!D654=\"\",\"\",'06 DAP'!D654)","v":""}]
[null,null,null,{"$f":"IF('06 DAP'!D655=\"\",\"\",'06 DAP'!D655)","v":""}]
[null,null,null,{"$f":"IF('06 DAP'!D656=\"\",\"\",'06 DAP'!D656)","v":""}]
[null,null,null,{"$f":"IF('06 DAP'!D657=\"\",\"\",'06 DAP'!D657)","v":""}]
[null,null,null,{"$f":"IF('06 DAP'!D658=\"\",\"\",'06 DAP'!D658)","v":""}]
[null,null,null,{"$f":"IF('06 DAP'!D659=\"\",\"\",'06 DAP'!D659)","v":""}]
[null,null,null,{"$f":"IF('06 DAP'!D660=\"\",\"\",'06 DAP'!D660)","v":""}]
[null,null,null,{"$f":"IF('06 DAP'!D661=\"\",\"\",'06 DAP'!D661)","v":""}]
[null,null,null,{"$f":"IF('06 DAP'!D662=\"\",\"\",'06 DAP'!D662)","v":""}]
[null,null,null,{"$f":"IF('06 DAP'!D663=\"\",\"\",'06 DAP'!D663)","v":""}]
[null,null,null,{"$f":"IF('06 DAP'!D664=\"\",\"\",'06 DAP'!D664)","v":""}]
[null,null,null,{"$f":"IF('06 DAP'!D665=\"\",\"\",'06 DAP'!D665)","v":""}]
[null,null,null,{"$f":"IF('06 DAP'!D666=\"\",\"\",'06 DAP'!D666)","v":""}]
[null,null,null,{"$f":"IF('06 DAP'!D667=\"\",\"\",'06 DAP'!D667)","v":""}]
[null,null,null,{"$f":"IF('06 DAP'!D668=\"\",\"\",'06 DAP'!D668)","v":""}]
[null,null,null,{"$f":"IF('06 DAP'!D669=\"\",\"\",'06 DAP'!D669)","v":""}]
[null,null,null,{"$f":"IF('06 DAP'!D670=\"\",\"\",'06 DAP'!D670)","v":""}]
[null,null,null,{"$f":"IF('06 DAP'!D671=\"\",\"\",'06 DAP'!D671)","v":""}]
[null,null,null,{"$f":"IF('06 DAP'!D672=\"\",\"\",'06 DAP'!D672)","v":""}]
[null,null,null,{"$f":"IF('06 DAP'!D673=\"\",\"\",'06 DAP'!D673)","v":""}]
[null,null,null,{"$f":"IF('06 DAP'!D674=\"\",\"\",'06 DAP'!D674)","v":""}]
[null,null,null,{"$f":"IF('06 DAP'!D675=\"\",\"\",'06 DAP'!D675)","v":""}]
[null,null,null,{"$f":"IF('06 DAP'!D676=\"\",\"\",'06 DAP'!D676)","v":""}]
[null,null,null,{"$f":"IF('06 DAP'!D677=\"\",\"\",'06 DAP'!D677)","v":""}]
[null,null,null,{"$f":"IF('06 DAP'!D678=\"\",\"\",'06 DAP'!D678)","v":""}]
[null,null,null,{"$f":"IF('06 DAP'!D679=\"\",\"\",'06 DAP'!D679)","v":""}]
[null,null,null,{"$f":"IF('06 DAP'!D680=\"\",\"\",'06 DAP'!D680)","v":""}]
[null,null,null,{"$f":"IF('06 DAP'!D681=\"\",\"\",'06 DAP'!D681)","v":""}]
[null,null,null,{"$f":"IF('06 DAP'!D682=\"\",\"\",'06 DAP'!D682)","v":""}]
[null,null,null,{"$f":"IF('06 DAP'!D683=\"\",\"\",'06 DAP'!D683)","v":""}]
[null,null,null,{"$f":"IF('06 DAP'!D684=\"\",\"\",'06 DAP'!D684)","v":""}]
[null,null,null,{"$f":"IF('06 DAP'!D685=\"\",\"\",'06 DAP'!D685)","v":""}]
[null,null,null,{"$f":"IF('06 DAP'!D686=\"\",\"\",'06 DAP'!D686)","v":""}]
[null,null,null,{"$f":"IF('06 DAP'!D687=\"\",\"\",'06 DAP'!D687)","v":""}]
[null,null,null,{"$f":"IF('06 DAP'!D688=\"\",\"\",'06 DAP'!D688)","v":""}]
[null,null,null,{"$f":"IF('06 DAP'!D689=\"\",\"\",'06 DAP'!D689)","v":""}]
[null,null,null,{"$f":"IF('06 DAP'!D690=\"\",\"\",'06 DAP'!D690)","v":""}]
[null,null,null,{"$f":"IF('06 DAP'!D691=\"\",\"\",'06 DAP'!D691)","v":""}]
[null,null,null,{"$f":"IF('06 DAP'!D692=\"\",\"\",'06 DAP'!D692)","v":""}]
[null,null,null,{"$f":"IF('06 DAP'!D693=\"\",\"\",'06 DAP'!D693)","v":""}]
[null,null,null,{"$f":"IF('06 DAP'!D694=\"\",\"\",'06 DAP'!D694)","v":""}]
[null,null,null,{"$f":"IF('06 DAP'!D695=\"\",\"\",'06 DAP'!D695)","v":""}]
[null,null,null,{"$f":"IF('06 DAP'!D696=\"\",\"\",'06 DAP'!D696)","v":""}]
[null,null,null,{"$f":"IF('06 DAP'!D697=\"\",\"\",'06 DAP'!D697)","v":""}]
[null,null,null,{"$f":"IF('06 DAP'!D698=\"\",\"\",'06 DAP'!D698)","v":""}]
[null,null,null,{"$f":"IF('06 DAP'!D699=\"\",\"\",'06 DAP'!D699)","v":""}]
[null,null,null,{"$f":"IF('06 DAP'!D700=\"\",\"\",'06 DAP'!D700)","v":""}]
[null,null,null,{"$f":"IF('06 DAP'!D701=\"\",\"\",'06 DAP'!D701)","v":""}]
[null,null,null,{"$f":"IF('06 DAP'!D702=\"\",\"\",'06 DAP'!D702)","v":""}]
[null,null,null,{"$f":"IF('06 DAP'!D703=\"\",\"\",'06 DAP'!D703)","v":""}]
[null,null,null,{"$f":"IF('06 DAP'!D704=\"\",\"\",'06 DAP'!D704)","v":""}]
[null,null,null,{"$f":"IF('06 DAP'!D705=\"\",\"\",'06 DAP'!D705)","v":""}]
[null,null,null,{"$f":"IF('06 DAP'!D706=\"\",\"\",'06 DAP'!D706)","v":""}]
[null,null,null,{"$f":"IF('06 DAP'!D707=\"\",\"\",'06 DAP'!D707)","v":""}]
[null,null,null,{"$f":"IF('06 DAP'!D708=\"\",\"\",'06 DAP'!D708)","v":""}]
[null,null,null,{"$f":"IF('06 DAP'!D709=\"\",\"\",'06 DAP'!D709)","v":""}]
[null,null,null,{"$f":"IF('06 DAP'!D710=\"\",\"\",'06 DAP'!D710)","v":""}]
[null,null,null,{"$f":"IF('06 DAP'!D711=\"\",\"\",'06 DAP'!D711)","v":""}]
[null,null,null,{"$f":"IF('06 DAP'!D712=\"\",\"\",'06 DAP'!D712)","v":""}]
[null,null,null,{"$f":"IF('06 DAP'!D713=\"\",\"\",'06 DAP'!D713)","v":""}]
[null,null,null,{"$f":"IF('06 DAP'!D714=\"\",\"\",'06 DAP'!D714)","v":""}]
[null,null,null,{"$f":"IF('06 DAP'!D715=\"\",\"\",'06 DAP'!D715)","v":""}]
[null,null,null,{"$f":"IF('06 DAP'!D716=\"\",\"\",'06 DAP'!D716)","v":""}]
[null,null,null,{"$f":"IF('06 DAP'!D717=\"\",\"\",'06 DAP'!D717)","v":""}]
[null,null,null,{"$f":"IF('06 DAP'!D718=\"\",\"\",'06 DAP'!D718)","v":""}]
[null,null,null,{"$f":"IF('06 DAP'!D719=\"\",\"\",'06 DAP'!D719)","v":""}]
[null,null,null,{"$f":"IF('06 DAP'!D720=\"\",\"\",'06 DAP'!D720)","v":""}]
[null,null,null,{"$f":"IF('06 DAP'!D721=\"\",\"\",'06 DAP'!D721)","v":""}]
[null,null,null,{"$f":"IF('06 DAP'!D722=\"\",\"\",'06 DAP'!D722)","v":""}]
[null,null,null,{"$f":"IF('06 DAP'!D723=\"\",\"\",'06 DAP'!D723)","v":""}]
[null,null,null,{"$f":"IF('06 DAP'!D724=\"\",\"\",'06 DAP'!D724)","v":""}]
[null,null,null,{"$f":"IF('06 DAP'!D725=\"\",\"\",'06 DAP'!D725)","v":""}]
[null,null,null,{"$f":"IF('06 DAP'!D726=\"\",\"\",'06 DAP'!D726)","v":""}]
[null,null,null,{"$f":"IF('06 DAP'!D727=\"\",\"\",'06 DAP'!D727)","v":""}]
[null,null,null,{"$f":"IF('06 DAP'!D728=\"\",\"\",'06 DAP'!D728)","v":""}]
[null,null,null,{"$f":"IF('06 DAP'!D729=\"\",\"\",'06 DAP'!D729)","v":""}]
[null,null,null,{"$f":"IF('06 DAP'!D730=\"\",\"\",'06 DAP'!D730)","v":""}]
[null,null,null,{"$f":"IF('06 DAP'!D731=\"\",\"\",'06 DAP'!D731)","v":""}]
[null,null,null,{"$f":"IF('06 DAP'!D732=\"\",\"\",'06 DAP'!D732)","v":""}]
[null,null,null,{"$f":"IF('06 DAP'!D733=\"\",\"\",'06 DAP'!D733)","v":""}]
[null,null,null,{"$f":"IF('06 DAP'!D734=\"\",\"\",'06 DAP'!D734)","v":""}]
[null,null,null,{"$f":"IF('06 DAP'!D735=\"\",\"\",'06 DAP'!D735)","v":""}]
[null,null,null,{"$f":"IF('06 DAP'!D736=\"\",\"\",'06 DAP'!D736)","v":""}]
[null,null,null,{"$f":"IF('06 DAP'!D737=\"\",\"\",'06 DAP'!D737)","v":""}]
[null,null,null,{"$f":"IF('06 DAP'!D738=\"\",\"\",'06 DAP'!D738)","v":""}]
[null,null,null,{"$f":"IF('06 DAP'!D739=\"\",\"\",'06 DAP'!D739)","v":""}]
[null,null,null,{"$f":"IF('06 DAP'!D740=\"\",\"\",'06 DAP'!D740)","v":""}]
[null,null,null,{"$f":"IF('06 DAP'!D741=\"\",\"\",'06 DAP'!D741)","v":""}]
[null,null,null,{"$f":"IF('06 DAP'!D742=\"\",\"\",'06 DAP'!D742)","v":""}]
[null,null,null,{"$f":"IF('06 DAP'!D743=\"\",\"\",'06 DAP'!D743)","v":""}]
[null,null,null,{"$f":"IF('06 DAP'!D744=\"\",\"\",'06 DAP'!D744)","v":""}]
[null,null,null,{"$f":"IF('06 DAP'!D745=\"\",\"\",'06 DAP'!D745)","v":""}]
[null,null,null,{"$f":"IF('06 DAP'!D746=\"\",\"\",'06 DAP'!D746)","v":""}]
[null,null,null,{"$f":"IF('06 DAP'!D747=\"\",\"\",'06 DAP'!D747)","v":""}]
[null,null,null,{"$f":"IF('06 DAP'!D748=\"\",\"\",'06 DAP'!D748)","v":""}]
[null,null,null,{"$f":"IF('06 DAP'!D749=\"\",\"\",'06 DAP'!D749)","v":""}]
[null,null,null,{"$f":"IF('06 DAP'!D750=\"\",\"\",'06 DAP'!D750)","v":""}]
[null,null,null,{"$f":"IF('06 DAP'!D751=\"\",\"\",'06 DAP'!D751)","v":""}]
[null,null,null,{"$f":"IF('06 DAP'!D752=\"\",\"\",'06 DAP'!D752)","v":""}]
[null,null,null,{"$f":"IF('06 DAP'!D753=\"\",\"\",'06 DAP'!D753)","v":""}]
[null,null,null,{"$f":"IF('06 DAP'!D754=\"\",\"\",'06 DAP'!D754)","v":""}]
[null,null,null,{"$f":"IF('06 DAP'!D755=\"\",\"\",'06 DAP'!D755)","v":""}]
[null,null,null,{"$f":"IF('06 DAP'!D756=\"\",\"\",'06 DAP'!D756)","v":""}]
[null,null,null,{"$f":"IF('06 DAP'!D757=\"\",\"\",'06 DAP'!D757)","v":""}]
[null,null,null,{"$f":"IF('06 DAP'!D758=\"\",\"\",'06 DAP'!D758)","v":""}]
[null,null,null,{"$f":"IF('06 DAP'!D759=\"\",\"\",'06 DAP'!D759)","v":""}]
[null,null,null,{"$f":"IF('06 DAP'!D760=\"\",\"\",'06 DAP'!D760)","v":""}]
[null,null,null,{"$f":"IF('06 DAP'!D761=\"\",\"\",'06 DAP'!D761)","v":""}]
[null,null,null,{"$f":"IF('06 DAP'!D762=\"\",\"\",'06 DAP'!D762)","v":""}]
[null,null,null,{"$f":"IF('06 DAP'!D763=\"\",\"\",'06 DAP'!D763)","v":""}]
[null,null,null,{"$f":"IF('06 DAP'!D764=\"\",\"\",'06 DAP'!D764)","v":""}]
[null,null,null,{"$f":"IF('06 DAP'!D765=\"\",\"\",'06 DAP'!D765)","v":""}]
[null,null,null,{"$f":"IF('06 DAP'!D766=\"\",\"\",'06 DAP'!D766)","v":""}]
[null,null,null,{"$f":"IF('06 DAP'!D767=\"\",\"\",'06 DAP'!D767)","v":""}]
[null,null,null,{"$f":"IF('06 DAP'!D768=\"\",\"\",'06 DAP'!D768)","v":""}]
[null,null,null,{"$f":"IF('06 DAP'!D769=\"\",\"\",'06 DAP'!D769)","v":""}]
[null,null,null,{"$f":"IF('06 DAP'!D770=\"\",\"\",'06 DAP'!D770)","v":""}]
[null,null,null,{"$f":"IF('06 DAP'!D771=\"\",\"\",'06 DAP'!D771)","v":""}]
[null,null,null,{"$f":"IF('06 DAP'!D772=\"\",\"\",'06 DAP'!D772)","v":""}]
[null,null,null,{"$f":"IF('06 DAP'!D773=\"\",\"\",'06 DAP'!D773)","v":""}]
[null,null,null,{"$f":"IF('06 DAP'!D774=\"\",\"\",'06 DAP'!D774)","v":""}]
[null,null,null,{"$f":"IF('06 DAP'!D775=\"\",\"\",'06 DAP'!D775)","v":""}]
[null,null,null,{"$f":"IF('06 DAP'!D776=\"\",\"\",'06 DAP'!D776)","v":""}]
[null,null,null,{"$f":"IF('06 DAP'!D777=\"\",\"\",'06 DAP'!D777)","v":""}]
[null,null,null,{"$f":"IF('06 DAP'!D778=\"\",\"\",'06 DAP'!D778)","v":""}]
[null,null,null,{"$f":"IF('06 DAP'!D779=\"\",\"\",'06 DAP'!D779)","v":""}]
[null,null,null,{"$f":"IF('06 DAP'!D780=\"\",\"\",'06 DAP'!D780)","v":""}]
[null,null,null,{"$f":"IF('06 DAP'!D781=\"\",\"\",'06 DAP'!D781)","v":""}]
[null,null,null,{"$f":"IF('06 DAP'!D782=\"\",\"\",'06 DAP'!D782)","v":""}]
[null,null,null,{"$f":"IF('06 DAP'!D783=\"\",\"\",'06 DAP'!D783)","v":""}]
[null,null,null,{"$f":"IF('06 DAP'!D784=\"\",\"\",'06 DAP'!D784)","v":""}]
[null,null,null,{"$f":"IF('06 DAP'!D785=\"\",\"\",'06 DAP'!D785)","v":""}]
[null,null,null,{"$f":"IF('06 DAP'!D786=\"\",\"\",'06 DAP'!D786)","v":""}]
[null,null,null,{"$f":"IF('06 DAP'!D787=\"\",\"\",'06 DAP'!D787)","v":""}]
[null,null,null,{"$f":"IF('06 DAP'!D788=\"\",\"\",'06 DAP'!D788)","v":""}]
[null,null,null,{"$f":"IF('06 DAP'!D789=\"\",\"\",'06 DAP'!D789)","v":""}]
[null,null,null,{"$f":"IF('06 DAP'!D790=\"\",\"\",'06 DAP'!D790)","v":""}]
[null,null,null,{"$f":"IF('06 DAP'!D791=\"\",\"\",'06 DAP'!D791)","v":""}]
[null,null,null,{"$f":"IF('06 DAP'!D792=\"\",\"\",'06 DAP'!D792)","v":""}]
[null,null,null,{"$f":"IF('06 DAP'!D793=\"\",\"\",'06 DAP'!D793)","v":""}]
[null,null,null,{"$f":"IF('06 DAP'!D794=\"\",\"\",'06 DAP'!D794)","v":""}]
[null,null,null,{"$f":"IF('06 DAP'!D795=\"\",\"\",'06 DAP'!D795)","v":""}]
[null,null,null,{"$f":"IF('06 DAP'!D796=\"\",\"\",'06 DAP'!D796)","v":""}]
[null,null,null,{"$f":"IF('06 DAP'!D797=\"\",\"\",'06 DAP'!D797)","v":""}]
[null,null,null,{"$f":"IF('06 DAP'!D798=\"\",\"\",'06 DAP'!D798)","v":""}]
[null,null,null,{"$f":"IF('06 DAP'!D799=\"\",\"\",'06 DAP'!D799)","v":""}]
[null,null,null,{"$f":"IF('06 DAP'!D800=\"\",\"\",'06 DAP'!D800)","v":""}]
[null,null,null,{"$f":"IF('06 DAP'!D801=\"\",\"\",'06 DAP'!D801)","v":""}]
[null,null,null,{"$f":"IF('06 DAP'!D802=\"\",\"\",'06 DAP'!D802)","v":""}]
[null,null,null,{"$f":"IF('06 DAP'!D803=\"\",\"\",'06 DAP'!D803)","v":""}]
[null,null,null,{"$f":"IF('06 DAP'!D804=\"\",\"\",'06 DAP'!D804)","v":""}]
[null,null,null,{"$f":"IF('06 DAP'!D805=\"\",\"\",'06 DAP'!D805)","v":""}]
[null,null,null,{"$f":"IF('06 DAP'!D806=\"\",\"\",'06 DAP'!D806)","v":""}]
[null,null,null,{"$f":"IF('06 DAP'!D807=\"\",\"\",'06 DAP'!D807)","v":""}]
[null,null,null,{"$f":"IF('06 DAP'!D808=\"\",\"\",'06 DAP'!D808)","v":""}]
[null,null,null,{"$f":"IF('06 DAP'!D809=\"\",\"\",'06 DAP'!D809)","v":""}]
[null,null,null,{"$f":"IF('06 DAP'!D810=\"\",\"\",'06 DAP'!D810)","v":""}]
[null,null,null,{"$f":"IF('06 DAP'!D811=\"\",\"\",'06 DAP'!D811)","v":""}]
[null,null,null,{"$f":"IF('06 DAP'!D812=\"\",\"\",'06 DAP'!D812)","v":""}]
[null,null,null,{"$f":"IF('06 DAP'!D813=\"\",\"\",'06 DAP'!D813)","v":""}]
[null,null,null,{"$f":"IF('06 DAP'!D814=\"\",\"\",'06 DAP'!D814)","v":""}]
[null,null,null,{"$f":"IF('06 DAP'!D815=\"\",\"\",'06 DAP'!D815)","v":""}]
[null,null,null,{"$f":"IF('06 DAP'!D816=\"\",\"\",'06 DAP'!D816)","v":""}]
[null,null,null,{"$f":"IF('06 DAP'!D817=\"\",\"\",'06 DAP'!D817)","v":""}]
[null,null,null,{"$f":"IF('06 DAP'!D818=\"\",\"\",'06 DAP'!D818)","v":""}]
[null,null,null,{"$f":"IF('06 DAP'!D819=\"\",\"\",'06 DAP'!D819)","v":""}]
[null,null,null,{"$f":"IF('06 DAP'!D820=\"\",\"\",'06 DAP'!D820)","v":""}]
[null,null,null,{"$f":"IF('06 DAP'!D821=\"\",\"\",'06 DAP'!D821)","v":""}]
[null,null,null,{"$f":"IF('06 DAP'!D822=\"\",\"\",'06 DAP'!D822)","v":""}]
[null,null,null,{"$f":"IF('06 DAP'!D823=\"\",\"\",'06 DAP'!D823)","v":""}]
[null,null,null,{"$f":"IF('06 DAP'!D824=\"\",\"\",'06 DAP'!D824)","v":""}]
[null,null,null,{"$f":"IF('06 DAP'!D825=\"\",\"\",'06 DAP'!D825)","v":""}]
[null,null,null,{"$f":"IF('06 DAP'!D826=\"\",\"\",'06 DAP'!D826)","v":""}]
[null,null,null,{"$f":"IF('06 DAP'!D827=\"\",\"\",'06 DAP'!D827)","v":""}]
[null,null,null,{"$f":"IF('06 DAP'!D828=\"\",\"\",'06 DAP'!D828)","v":""}]
[null,null,null,{"$f":"IF('06 DAP'!D829=\"\",\"\",'06 DAP'!D829)","v":""}]
[null,null,null,{"$f":"IF('06 DAP'!D830=\"\",\"\",'06 DAP'!D830)","v":""}]
[null,null,null,{"$f":"IF('06 DAP'!D831=\"\",\"\",'06 DAP'!D831)","v":""}]
[null,null,null,{"$f":"IF('06 DAP'!D832=\"\",\"\",'06 DAP'!D832)","v":""}]
[null,null,null,{"$f":"IF('06 DAP'!D833=\"\",\"\",'06 DAP'!D833)","v":""}]
[null,null,null,{"$f":"IF('06 DAP'!D834=\"\",\"\",'06 DAP'!D834)","v":""}]
[null,null,null,{"$f":"IF('06 DAP'!D835=\"\",\"\",'06 DAP'!D835)","v":""}]
[null,null,null,{"$f":"IF('06 DAP'!D836=\"\",\"\",'06 DAP'!D836)","v":""}]
[null,null,null,{"$f":"IF('06 DAP'!D837=\"\",\"\",'06 DAP'!D837)","v":""}]
[null,null,null,{"$f":"IF('06 DAP'!D838=\"\",\"\",'06 DAP'!D838)","v":""}]
[null,null,null,{"$f":"IF('06 DAP'!D839=\"\",\"\",'06 DAP'!D839)","v":""}]
[null,null,null,{"$f":"IF('06 DAP'!D840=\"\",\"\",'06 DAP'!D840)","v":""}]
[null,null,null,{"$f":"IF('06 DAP'!D841=\"\",\"\",'06 DAP'!D841)","v":""}]
[null,null,null,{"$f":"IF('06 DAP'!D842=\"\",\"\",'06 DAP'!D842)","v":""}]
[null,null,null,{"$f":"IF('06 DAP'!D843=\"\",\"\",'06 DAP'!D843)","v":""}]
[null,null,null,{"$f":"IF('06 DAP'!D844=\"\",\"\",'06 DAP'!D844)","v":""}]
[null,null,null,{"$f":"IF('06 DAP'!D845=\"\",\"\",'06 DAP'!D845)","v":""}]
[null,null,null,{"$f":"IF('06 DAP'!D846=\"\",\"\",'06 DAP'!D846)","v":""}]
[null,null,null,{"$f":"IF('06 DAP'!D847=\"\",\"\",'06 DAP'!D847)","v":""}]
[null,null,null,{"$f":"IF('06 DAP'!D848=\"\",\"\",'06 DAP'!D848)","v":""}]
[null,null,null,{"$f":"IF('06 DAP'!D849=\"\",\"\",'06 DAP'!D849)","v":""}]
[null,null,null,{"$f":"IF('06 DAP'!D850=\"\",\"\",'06 DAP'!D850)","v":""}]
[null,null,null,{"$f":"IF('06 DAP'!D851=\"\",\"\",'06 DAP'!D851)","v":""}]
[null,null,null,{"$f":"IF('06 DAP'!D852=\"\",\"\",'06 DAP'!D852)","v":""}]
[null,null,null,{"$f":"IF('06 DAP'!D853=\"\",\"\",'06 DAP'!D853)","v":""}]
[null,null,null,{"$f":"IF('06 DAP'!D854=\"\",\"\",'06 DAP'!D854)","v":""}]
[null,null,null,{"$f":"IF('06 DAP'!D855=\"\",\"\",'06 DAP'!D855)","v":""}]
[null,null,null,{"$f":"IF('06 DAP'!D856=\"\",\"\",'06 DAP'!D856)","v":""}]
[null,null,null,{"$f":"IF('06 DAP'!D857=\"\",\"\",'06 DAP'!D857)","v":""}]
[null,null,null,{"$f":"IF('06 DAP'!D858=\"\",\"\",'06 DAP'!D858)","v":""}]
[null,null,null,{"$f":"IF('06 DAP'!D859=\"\",\"\",'06 DAP'!D859)","v":""}]
[null,null,null,{"$f":"IF('06 DAP'!D860=\"\",\"\",'06 DAP'!D860)","v":""}]
[null,null,null,{"$f":"IF('06 DAP'!D861=\"\",\"\",'06 DAP'!D861)","v":""}]
[null,null,null,{"$f":"IF('06 DAP'!D862=\"\",\"\",'06 DAP'!D862)","v":""}]
[null,null,null,{"$f":"IF('06 DAP'!D863=\"\",\"\",'06 DAP'!D863)","v":""}]
[null,null,null,{"$f":"IF('06 DAP'!D864=\"\",\"\",'06 DAP'!D864)","v":""}]
[null,null,null,{"$f":"IF('06 DAP'!D865=\"\",\"\",'06 DAP'!D865)","v":""}]
[null,null,null,{"$f":"IF('06 DAP'!D866=\"\",\"\",'06 DAP'!D866)","v":""}]
[null,null,null,{"$f":"IF('06 DAP'!D867=\"\",\"\",'06 DAP'!D867)","v":""}]
[null,null,null,{"$f":"IF('06 DAP'!D868=\"\",\"\",'06 DAP'!D868)","v":""}]
[null,null,null,{"$f":"IF('06 DAP'!D869=\"\",\"\",'06 DAP'!D869)","v":""}]
[null,null,null,{"$f":"IF('06 DAP'!D870=\"\",\"\",'06 DAP'!D870)","v":""}]
[null,null,null,{"$f":"IF('06 DAP'!D871=\"\",\"\",'06 DAP'!D871)","v":""}]
[null,null,null,{"$f":"IF('06 DAP'!D872=\"\",\"\",'06 DAP'!D872)","v":""}]
[null,null,null,{"$f":"IF('06 DAP'!D873=\"\",\"\",'06 DAP'!D873)","v":""}]
[null,null,null,{"$f":"IF('06 DAP'!D874=\"\",\"\",'06 DAP'!D874)","v":""}]
[null,null,null,{"$f":"IF('06 DAP'!D875=\"\",\"\",'06 DAP'!D875)","v":""}]
[null,null,null,{"$f":"IF('06 DAP'!D876=\"\",\"\",'06 DAP'!D876)","v":""}]
[null,null,null,{"$f":"IF('06 DAP'!D877=\"\",\"\",'06 DAP'!D877)","v":""}]
[null,null,null,{"$f":"IF('06 DAP'!D878=\"\",\"\",'06 DAP'!D878)","v":""}]
[null,null,null,{"$f":"IF('06 DAP'!D879=\"\",\"\",'06 DAP'!D879)","v":""}]
[null,null,null,{"$f":"IF('06 DAP'!D880=\"\",\"\",'06 DAP'!D880)","v":""}]
[null,null,null,{"$f":"IF('06 DAP'!D881=\"\",\"\",'06 DAP'!D881)","v":""}]
[null,null,null,{"$f":"IF('06 DAP'!D882=\"\",\"\",'06 DAP'!D882)","v":""}]
[null,null,null,{"$f":"IF('06 DAP'!D883=\"\",\"\",'06 DAP'!D883)","v":""}]
[null,null,null,{"$f":"IF('06 DAP'!D884=\"\",\"\",'06 DAP'!D884)","v":""}]
[null,null,null,{"$f":"IF('06 DAP'!D885=\"\",\"\",'06 DAP'!D885)","v":""}]
[null,null,null,{"$f":"IF('06 DAP'!D886=\"\",\"\",'06 DAP'!D886)","v":""}]
[null,null,null,{"$f":"IF('06 DAP'!D887=\"\",\"\",'06 DAP'!D887)","v":""}]
[null,null,null,{"$f":"IF('06 DAP'!D888=\"\",\"\",'06 DAP'!D888)","v":""}]
[null,null,null,{"$f":"IF('06 DAP'!D889=\"\",\"\",'06 DAP'!D889)","v":""}]
[null,null,null,{"$f":"IF('06 DAP'!D890=\"\",\"\",'06 DAP'!D890)","v":""}]
[null,null,null,{"$f":"IF('06 DAP'!D891=\"\",\"\",'06 DAP'!D891)","v":""}]
[null,null,null,{"$f":"IF('06 DAP'!D892=\"\",\"\",'06 DAP'!D892)","v":""}]
[null,null,null,{"$f":"IF('06 DAP'!D893=\"\",\"\",'06 DAP'!D893)","v":""}]
[null,null,null,{"$f":"IF('06 DAP'!D894=\"\",\"\",'06 DAP'!D894)","v":""}]
[null,null,null,{"$f":"IF('06 DAP'!D895=\"\",\"\",'06 DAP'!D895)","v":""}]
[null,null,null,{"$f":"IF('06 DAP'!D896=\"\",\"\",'06 DAP'!D896)","v":""}]
[null,null,null,{"$f":"IF('06 DAP'!D897=\"\",\"\",'06 DAP'!D897)","v":""}]
[null,null,null,{"$f":"IF('06 DAP'!D898=\"\",\"\",'06 DAP'!D898)","v":""}]
[null,null,null,{"$f":"IF('06 DAP'!D899=\"\",\"\",'06 DAP'!D899)","v":""}]
[null,null,null,{"$f":"IF('06 DAP'!D900=\"\",\"\",'06 DAP'!D900)","v":""}]
[null,null,null,{"$f":"IF('06 DAP'!D901=\"\",\"\",'06 DAP'!D901)","v":""}]
[null,null,null,{"$f":"IF('06 DAP'!D902=\"\",\"\",'06 DAP'!D902)","v":""}]
[null,null,null,{"$f":"IF('06 DAP'!D903=\"\",\"\",'06 DAP'!D903)","v":""}]
[null,null,null,{"$f":"IF('06 DAP'!D904=\"\",\"\",'06 DAP'!D904)","v":""}]
[null,null,null,{"$f":"IF('06 DAP'!D905=\"\",\"\",'06 DAP'!D905)","v":""}]
[null,null,null,{"$f":"IF('06 DAP'!D906=\"\",\"\",'06 DAP'!D906)","v":""}]
[null,null,null,{"$f":"IF('06 DAP'!D907=\"\",\"\",'06 DAP'!D907)","v":""}]
[null,null,null,{"$f":"IF('06 DAP'!D908=\"\",\"\",'06 DAP'!D908)","v":""}]
[null,null,null,{"$f":"IF('06 DAP'!D909=\"\",\"\",'06 DAP'!D909)","v":""}]
[null,null,null,{"$f":"IF('06 DAP'!D910=\"\",\"\",'06 DAP'!D910)","v":""}]
[null,null,null,{"$f":"IF('06 DAP'!D911=\"\",\"\",'06 DAP'!D911)","v":""}]
[null,null,null,{"$f":"IF('06 DAP'!D912=\"\",\"\",'06 DAP'!D912)","v":""}]
[null,null,null,{"$f":"IF('06 DAP'!D913=\"\",\"\",'06 DAP'!D913)","v":""}]
[null,null,null,{"$f":"IF('06 DAP'!D914=\"\",\"\",'06 DAP'!D914)","v":""}]
[null,null,null,{"$f":"IF('06 DAP'!D915=\"\",\"\",'06 DAP'!D915)","v":""}]
[null,null,null,{"$f":"IF('06 DAP'!D916=\"\",\"\",'06 DAP'!D916)","v":""}]
[null,null,null,{"$f":"IF('06 DAP'!D917=\"\",\"\",'06 DAP'!D917)","v":""}]
[null,null,null,{"$f":"IF('06 DAP'!D918=\"\",\"\",'06 DAP'!D918)","v":""}]
[null,null,null,{"$f":"IF('06 DAP'!D919=\"\",\"\",'06 DAP'!D919)","v":""}]
[null,null,null,{"$f":"IF('06 DAP'!D920=\"\",\"\",'06 DAP'!D920)","v":""}]
[null,null,null,{"$f":"IF('06 DAP'!D921=\"\",\"\",'06 DAP'!D921)","v":""}]
[null,null,null,{"$f":"IF('06 DAP'!D922=\"\",\"\",'06 DAP'!D922)","v":""}]
[null,null,null,{"$f":"IF('06 DAP'!D923=\"\",\"\",'06 DAP'!D923)","v":""}]
[null,null,null,{"$f":"IF('06 DAP'!D924=\"\",\"\",'06 DAP'!D924)","v":""}]
[null,null,null,{"$f":"IF('06 DAP'!D925=\"\",\"\",'06 DAP'!D925)","v":""}]
[null,null,null,{"$f":"IF('06 DAP'!D926=\"\",\"\",'06 DAP'!D926)","v":""}]
[null,null,null,{"$f":"IF('06 DAP'!D927=\"\",\"\",'06 DAP'!D927)","v":""}]
[null,null,null,{"$f":"IF('06 DAP'!D928=\"\",\"\",'06 DAP'!D928)","v":""}]
[null,null,null,{"$f":"IF('06 DAP'!D929=\"\",\"\",'06 DAP'!D929)","v":""}]
[null,null,null,{"$f":"IF('06 DAP'!D930=\"\",\"\",'06 DAP'!D930)","v":""}]
[null,null,null,{"$f":"IF('06 DAP'!D931=\"\",\"\",'06 DAP'!D931)","v":""}]
[null,null,null,{"$f":"IF('06 DAP'!D932=\"\",\"\",'06 DAP'!D932)","v":""}]
[null,null,null,{"$f":"IF('06 DAP'!D933=\"\",\"\",'06 DAP'!D933)","v":""}]
[null,null,null,{"$f":"IF('06 DAP'!D934=\"\",\"\",'06 DAP'!D934)","v":""}]
[null,null,null,{"$f":"IF('06 DAP'!D935=\"\",\"\",'06 DAP'!D935)","v":""}]
[null,null,null,{"$f":"IF('06 DAP'!D936=\"\",\"\",'06 DAP'!D936)","v":""}]
[null,null,null,{"$f":"IF('06 DAP'!D937=\"\",\"\",'06 DAP'!D937)","v":""}]
[null,null,null,{"$f":"IF('06 DAP'!D938=\"\",\"\",'06 DAP'!D938)","v":""}]
[null,null,null,{"$f":"IF('06 DAP'!D939=\"\",\"\",'06 DAP'!D939)","v":""}]
[null,null,null,{"$f":"IF('06 DAP'!D940=\"\",\"\",'06 DAP'!D940)","v":""}]
[null,null,null,{"$f":"IF('06 DAP'!D941=\"\",\"\",'06 DAP'!D941)","v":""}]
[null,null,null,{"$f":"IF('06 DAP'!D942=\"\",\"\",'06 DAP'!D942)","v":""}]
[null,null,null,{"$f":"IF('06 DAP'!D943=\"\",\"\",'06 DAP'!D943)","v":""}]
[null,null,null,{"$f":"IF('06 DAP'!D944=\"\",\"\",'06 DAP'!D944)","v":""}]
[null,null,null,{"$f":"IF('06 DAP'!D945=\"\",\"\",'06 DAP'!D945)","v":""}]
[null,null,null,{"$f":"IF('06 DAP'!D946=\"\",\"\",'06 DAP'!D946)","v":""}]
[null,null,null,{"$f":"IF('06 DAP'!D947=\"\",\"\",'06 DAP'!D947)","v":""}]
[null,null,null,{"$f":"IF('06 DAP'!D948=\"\",\"\",'06 DAP'!D948)","v":""}]
[null,null,null,{"$f":"IF('06 DAP'!D949=\"\",\"\",'06 DAP'!D949)","v":""}]
[null,null,null,{"$f":"IF('06 DAP'!D950=\"\",\"\",'06 DAP'!D950)","v":""}]
[null,null,null,{"$f":"IF('06 DAP'!D951=\"\",\"\",'06 DAP'!D951)","v":""}]
[null,null,null,{"$f":"IF('06 DAP'!D952=\"\",\"\",'06 DAP'!D952)","v":""}]
[null,null,null,{"$f":"IF('06 DAP'!D953=\"\",\"\",'06 DAP'!D953)","v":""}]
[null,null,null,{"$f":"IF('06 DAP'!D954=\"\",\"\",'06 DAP'!D954)","v":""}]
[null,null,null,{"$f":"IF('06 DAP'!D955=\"\",\"\",'06 DAP'!D955)","v":""}]
[null,null,null,{"$f":"IF('06 DAP'!D956=\"\",\"\",'06 DAP'!D956)","v":""}]
[null,null,null,{"$f":"IF('06 DAP'!D957=\"\",\"\",'06 DAP'!D957)","v":""}]
[null,null,null,{"$f":"IF('06 DAP'!D958=\"\",\"\",'06 DAP'!D958)","v":""}]
[null,null,null,{"$f":"IF('06 DAP'!D959=\"\",\"\",'06 DAP'!D959)","v":""}]
[null,null,null,{"$f":"IF('06 DAP'!D960=\"\",\"\",'06 DAP'!D960)","v":""}]
[null,null,null,{"$f":"IF('06 DAP'!D961=\"\",\"\",'06 DAP'!D961)","v":""}]
[null,null,null,{"$f":"IF('06 DAP'!D962=\"\",\"\",'06 DAP'!D962)","v":""}]
[null,null,null,{"$f":"IF('06 DAP'!D963=\"\",\"\",'06 DAP'!D963)","v":""}]
[null,null,null,{"$f":"IF('06 DAP'!D964=\"\",\"\",'06 DAP'!D964)","v":""}]
[null,null,null,{"$f":"IF('06 DAP'!D965=\"\",\"\",'06 DAP'!D965)","v":""}]
[null,null,null,{"$f":"IF('06 DAP'!D966=\"\",\"\",'06 DAP'!D966)","v":""}]
[null,null,null,{"$f":"IF('06 DAP'!D967=\"\",\"\",'06 DAP'!D967)","v":""}]
[null,null,null,{"$f":"IF('06 DAP'!D968=\"\",\"\",'06 DAP'!D968)","v":""}]
[null,null,null,{"$f":"IF('06 DAP'!D969=\"\",\"\",'06 DAP'!D969)","v":""}]
[null,null,null,{"$f":"IF('06 DAP'!D970=\"\",\"\",'06 DAP'!D970)","v":""}]
[null,null,null,{"$f":"IF('06 DAP'!D971=\"\",\"\",'06 DAP'!D971)","v":""}]
[null,null,null,{"$f":"IF('06 DAP'!D972=\"\",\"\",'06 DAP'!D972)","v":""}]
[null,null,null,{"$f":"IF('06 DAP'!D973=\"\",\"\",'06 DAP'!D973)","v":""}]
[null,null,null,{"$f":"IF('06 DAP'!D974=\"\",\"\",'06 DAP'!D974)","v":""}]
[null,null,null,{"$f":"IF('06 DAP'!D975=\"\",\"\",'06 DAP'!D975)","v":""}]
[null,null,null,{"$f":"IF('06 DAP'!D976=\"\",\"\",'06 DAP'!D976)","v":""}]
[null,null,null,{"$f":"IF('06 DAP'!D977=\"\",\"\",'06 DAP'!D977)","v":""}]
[null,null,null,{"$f":"IF('06 DAP'!D978=\"\",\"\",'06 DAP'!D978)","v":""}]
[null,null,null,{"$f":"IF('06 DAP'!D979=\"\",\"\",'06 DAP'!D979)","v":""}]
[null,null,null,{"$f":"IF('06 DAP'!D980=\"\",\"\",'06 DAP'!D980)","v":""}]
[null,null,null,{"$f":"IF('06 DAP'!D981=\"\",\"\",'06 DAP'!D981)","v":""}]
[null,null,null,{"$f":"IF('06 DAP'!D982=\"\",\"\",'06 DAP'!D982)","v":""}]
[null,null,null,{"$f":"IF('06 DAP'!D983=\"\",\"\",'06 DAP'!D983)","v":""}]
[null,null,null,{"$f":"IF('06 DAP'!D984=\"\",\"\",'06 DAP'!D984)","v":""}]
[null,null,null,{"$f":"IF('06 DAP'!D985=\"\",\"\",'06 DAP'!D985)","v":""}]
[null,null,null,{"$f":"IF('06 DAP'!D986=\"\",\"\",'06 DAP'!D986)","v":""}]
[null,null,null,{"$f":"IF('06 DAP'!D987=\"\",\"\",'06 DAP'!D987)","v":""}]
[null,null,null,{"$f":"IF('06 DAP'!D988=\"\",\"\",'06 DAP'!D988)","v":""}]
[null,null,null,{"$f":"IF('06 DAP'!D989=\"\",\"\",'06 DAP'!D989)","v":""}]
[null,null,null,{"$f":"IF('06 DAP'!D990=\"\",\"\",'06 DAP'!D990)","v":""}]
[null,null,null,{"$f":"IF('06 DAP'!D991=\"\",\"\",'06 DAP'!D991)","v":""}]
[null,null,null,{"$f":"IF('06 DAP'!D992=\"\",\"\",'06 DAP'!D992)","v":""}]
[null,null,null,{"$f":"IF('06 DAP'!D993=\"\",\"\",'06 DAP'!D993)","v":""}]
[null,null,null,{"$f":"IF('06 DAP'!D994=\"\",\"\",'06 DAP'!D994)","v":""}]
[null,null,null,{"$f":"IF('06 DAP'!D995=\"\",\"\",'06 DAP'!D995)","v":""}]
[null,null,null,{"$f":"IF('06 DAP'!D996=\"\",\"\",'06 DAP'!D996)","v":""}]
[null,null,null,{"$f":"IF('06 DAP'!D997=\"\",\"\",'06 DAP'!D997)","v":""}]
[null,null,null,{"$f":"IF('06 DAP'!D998=\"\",\"\",'06 DAP'!D998)","v":""}]
[null,null,null,{"$f":"IF('06 DAP'!D999=\"\",\"\",'06 DAP'!D999)","v":""}]
[null,null,null,{"$f":"IF('06 DAP'!D1000=\"\",\"\",'06 DAP'!D1000)","v":""}]
[null,null,null,{"$f":"IF('06 DAP'!D1001=\"\",\"\",'06 DAP'!D1001)","v":""}]
[null,null,null,{"$f":"IF('06 DAP'!D1002=\"\",\"\",'06 DAP'!D1002)","v":""}]
[null,null,null,{"$f":"IF('06 DAP'!D1003=\"\",\"\",'06 DAP'!D1003)","v":""}]
[null,null,null,{"$f":"IF('06 DAP'!D1004=\"\",\"\",'06 DAP'!D1004)","v":""}]
[null,null,null,{"$f":"IF('06 DAP'!D1005=\"\",\"\",'06 DAP'!D1005)","v":""}]
[null,null,null,{"$f":"IF('06 DAP'!D1006=\"\",\"\",'06 DAP'!D1006)","v":""}]
[null,null,null,{"$f":"IF('06 DAP'!D1007=\"\",\"\",'06 DAP'!D1007)","v":""}]
[null,null,null,{"$f":"IF('06 DAP'!D1008=\"\",\"\",'06 DAP'!D1008)","v":""}]
[null,null,null,{"$f":"IF('06 DAP'!D1009=\"\",\"\",'06 DAP'!D1009)","v":""}]
[null,null,null,{"$f":"IF('06 DAP'!D1010=\"\",\"\",'06 DAP'!D1010)","v":""}]
[null,null,null,{"$f":"IF('06 DAP'!D1011=\"\",\"\",'06 DAP'!D1011)","v":""}]
[null,null,null,{"$f":"IF('06 DAP'!D1012=\"\",\"\",'06 DAP'!D1012)","v":""}]
[null,null,null,{"$f":"IF('06 DAP'!D1013=\"\",\"\",'06 DAP'!D1013)","v":""}]
[null,null,null,{"$f":"IF('06 DAP'!D1014=\"\",\"\",'06 DAP'!D1014)","v":""}]
[null,null,null,{"$f":"IF('06 DAP'!D1015=\"\",\"\",'06 DAP'!D1015)","v":""}]
[null,null,null,{"$f":"IF('06 DAP'!D1016=\"\",\"\",'06 DAP'!D1016)","v":""}]
[null,null,null,{"$f":"IF('06 DAP'!D1017=\"\",\"\",'06 DAP'!D1017)","v":""}]
[null,null,null,{"$f":"IF('06 DAP'!D1018=\"\",\"\",'06 DAP'!D1018)","v":""}]
[null,null,null,{"$f":"IF('06 DAP'!D1019=\"\",\"\",'06 DAP'!D1019)","v":""}]
[null,null,null,{"$f":"IF('06 DAP'!D1020=\"\",\"\",'06 DAP'!D1020)","v":""}]
[null,null,null,{"$f":"IF('06 DAP'!D1021=\"\",\"\",'06 DAP'!D1021)","v":""}]
[null,null,null,{"$f":"IF('06 DAP'!D1022=\"\",\"\",'06 DAP'!D1022)","v":""}]
[null,null,null,{"$f":"IF('06 DAP'!D1023=\"\",\"\",'06 DAP'!D1023)","v":""}]
[null,null,null,{"$f":"IF('06 DAP'!D1024=\"\",\"\",'06 DAP'!D1024)","v":""}]
[null,null,null,{"$f":"IF('06 DAP'!D1025=\"\",\"\",'06 DAP'!D1025)","v":""}]
[null,null,null,{"$f":"IF('06 DAP'!D1026=\"\",\"\",'06 DAP'!D1026)","v":""}]
[null,null,null,{"$f":"IF('06 DAP'!D1027=\"\",\"\",'06 DAP'!D1027)","v":""}]
[null,null,null,{"$f":"IF('06 DAP'!D1028=\"\",\"\",'06 DAP'!D1028)","v":""}]
[null,null,null,{"$f":"IF('06 DAP'!D1029=\"\",\"\",'06 DAP'!D1029)","v":""}]
[null,null,null,{"$f":"IF('06 DAP'!D1030=\"\",\"\",'06 DAP'!D1030)","v":""}]
[null,null,null,{"$f":"IF('06 DAP'!D1031=\"\",\"\",'06 DAP'!D1031)","v":""}]
[null,null,null,{"$f":"IF('06 DAP'!D1032=\"\",\"\",'06 DAP'!D1032)","v":""}]
[null,null,null,{"$f":"IF('06 DAP'!D1033=\"\",\"\",'06 DAP'!D1033)","v":""}]
[null,null,null,{"$f":"IF('06 DAP'!D1034=\"\",\"\",'06 DAP'!D1034)","v":""}]
[null,null,null,{"$f":"IF('06 DAP'!D1035=\"\",\"\",'06 DAP'!D1035)","v":""}]
[null,null,null,{"$f":"IF('06 DAP'!D1036=\"\",\"\",'06 DAP'!D1036)","v":""}]
[null,null,null,{"$f":"IF('06 DAP'!D1037=\"\",\"\",'06 DAP'!D1037)","v":""}]
[null,null,null,{"$f":"IF('06 DAP'!D1038=\"\",\"\",'06 DAP'!D1038)","v":""}]
[null,null,null,{"$f":"IF('06 DAP'!D1039=\"\",\"\",'06 DAP'!D1039)","v":""}]
[null,null,null,{"$f":"IF('06 DAP'!D1040=\"\",\"\",'06 DAP'!D1040)","v":""}]
[null,null,null,{"$f":"IF('06 DAP'!D1041=\"\",\"\",'06 DAP'!D1041)","v":""}]
[null,null,null,{"$f":"IF('06 DAP'!D1042=\"\",\"\",'06 DAP'!D1042)","v":""}]
[null,null,null,{"$f":"IF('06 DAP'!D1043=\"\",\"\",'06 DAP'!D1043)","v":""}]
[null,null,null,{"$f":"IF('06 DAP'!D1044=\"\",\"\",'06 DAP'!D1044)","v":""}]
[null,null,null,{"$f":"IF('06 DAP'!D1045=\"\",\"\",'06 DAP'!D1045)","v":""}]
[null,null,null,{"$f":"IF('06 DAP'!D1046=\"\",\"\",'06 DAP'!D1046)","v":""}]
[null,null,null,{"$f":"IF('06 DAP'!D1047=\"\",\"\",'06 DAP'!D1047)","v":""}]
[null,null,null,{"$f":"IF('06 DAP'!D1048=\"\",\"\",'06 DAP'!D1048)","v":""}]
[null,null,null,{"$f":"IF('06 DAP'!D1049=\"\",\"\",'06 DAP'!D1049)","v":""}]
[null,null,null,{"$f":"IF('06 DAP'!D1050=\"\",\"\",'06 DAP'!D1050)","v":""}]
[null,null,null,{"$f":"IF('06 DAP'!D1051=\"\",\"\",'06 DAP'!D1051)","v":""}]
[null,null,null,{"$f":"IF('06 DAP'!D1052=\"\",\"\",'06 DAP'!D1052)","v":""}]
[null,null,null,{"$f":"IF('06 DAP'!D1053=\"\",\"\",'06 DAP'!D1053)","v":""}]
[null,null,null,{"$f":"IF('06 DAP'!D1054=\"\",\"\",'06 DAP'!D1054)","v":""}]
[null,null,null,{"$f":"IF('06 DAP'!D1055=\"\",\"\",'06 DAP'!D1055)","v":""}]
[null,null,null,{"$f":"IF('06 DAP'!D1056=\"\",\"\",'06 DAP'!D1056)","v":""}]
[null,null,null,{"$f":"IF('06 DAP'!D1057=\"\",\"\",'06 DAP'!D1057)","v":""}]
[null,null,null,{"$f":"IF('06 DAP'!D1058=\"\",\"\",'06 DAP'!D1058)","v":""}]
[null,null,null,{"$f":"IF('06 DAP'!D1059=\"\",\"\",'06 DAP'!D1059)","v":""}]
[null,null,null,{"$f":"IF('06 DAP'!D1060=\"\",\"\",'06 DAP'!D1060)","v":""}]
[null,null,null,{"$f":"IF('06 DAP'!D1061=\"\",\"\",'06 DAP'!D1061)","v":""}]
[null,null,null,{"$f":"IF('06 DAP'!D1062=\"\",\"\",'06 DAP'!D1062)","v":""}]
[null,null,null,{"$f":"IF('06 DAP'!D1063=\"\",\"\",'06 DAP'!D1063)","v":""}]
[null,null,null,{"$f":"IF('06 DAP'!D1064=\"\",\"\",'06 DAP'!D1064)","v":""}]
[null,null,null,{"$f":"IF('06 DAP'!D1065=\"\",\"\",'06 DAP'!D1065)","v":""}]
[null,null,null,{"$f":"IF('06 DAP'!D1066=\"\",\"\",'06 DAP'!D1066)","v":""}]
[null,null,null,{"$f":"IF('06 DAP'!D1067=\"\",\"\",'06 DAP'!D1067)","v":""}]
[null,null,null,{"$f":"IF('06 DAP'!D1068=\"\",\"\",'06 DAP'!D1068)","v":""}]
[null,null,null,{"$f":"IF('06 DAP'!D1069=\"\",\"\",'06 DAP'!D1069)","v":""}]
[null,null,null,{"$f":"IF('06 DAP'!D1070=\"\",\"\",'06 DAP'!D1070)","v":""}]
[null,null,null,{"$f":"IF('06 DAP'!D1071=\"\",\"\",'06 DAP'!D1071)","v":""}]
[null,null,null,{"$f":"IF('06 DAP'!D1072=\"\",\"\",'06 DAP'!D1072)","v":""}]
[null,null,null,{"$f":"IF('06 DAP'!D1073=\"\",\"\",'06 DAP'!D1073)","v":""}]
[null,null,null,{"$f":"IF('06 DAP'!D1074=\"\",\"\",'06 DAP'!D1074)","v":""}]
[null,null,null,{"$f":"IF('06 DAP'!D1075=\"\",\"\",'06 DAP'!D1075)","v":""}]
[null,null,null,{"$f":"IF('06 DAP'!D1076=\"\",\"\",'06 DAP'!D1076)","v":""}]
[null,null,null,{"$f":"IF('06 DAP'!D1077=\"\",\"\",'06 DAP'!D1077)","v":""}]
[null,null,null,{"$f":"IF('06 DAP'!D1078=\"\",\"\",'06 DAP'!D1078)","v":""}]
[null,null,null,{"$f":"IF('06 DAP'!D1079=\"\",\"\",'06 DAP'!D1079)","v":""}]
[null,null,null,{"$f":"IF('06 DAP'!D1080=\"\",\"\",'06 DAP'!D1080)","v":""}]
[null,null,null,{"$f":"IF('06 DAP'!D1081=\"\",\"\",'06 DAP'!D1081)","v":""}]
[null,null,null,{"$f":"IF('06 DAP'!D1082=\"\",\"\",'06 DAP'!D1082)","v":""}]
[null,null,null,{"$f":"IF('06 DAP'!D1083=\"\",\"\",'06 DAP'!D1083)","v":""}]
[null,null,null,{"$f":"IF('06 DAP'!D1084=\"\",\"\",'06 DAP'!D1084)","v":""}]
[null,null,null,{"$f":"IF('06 DAP'!D1085=\"\",\"\",'06 DAP'!D1085)","v":""}]
[null,null,null,{"$f":"IF('06 DAP'!D1086=\"\",\"\",'06 DAP'!D1086)","v":""}]
[null,null,null,{"$f":"IF('06 DAP'!D1087=\"\",\"\",'06 DAP'!D1087)","v":""}]
[null,null,null,{"$f":"IF('06 DAP'!D1088=\"\",\"\",'06 DAP'!D1088)","v":""}]
[null,null,null,{"$f":"IF('06 DAP'!D1089=\"\",\"\",'06 DAP'!D1089)","v":""}]
[null,null,null,{"$f":"IF('06 DAP'!D1090=\"\",\"\",'06 DAP'!D1090)","v":""}]
[null,null,null,{"$f":"IF('06 DAP'!D1091=\"\",\"\",'06 DAP'!D1091)","v":""}]
[null,null,null,{"$f":"IF('06 DAP'!D1092=\"\",\"\",'06 DAP'!D1092)","v":""}]
[null,null,null,{"$f":"IF('06 DAP'!D1093=\"\",\"\",'06 DAP'!D1093)","v":""}]
[null,null,null,{"$f":"IF('06 DAP'!D1094=\"\",\"\",'06 DAP'!D1094)","v":""}]
[null,null,null,{"$f":"IF('06 DAP'!D1095=\"\",\"\",'06 DAP'!D1095)","v":""}]
[null,null,null,{"$f":"IF('06 DAP'!D1096=\"\",\"\",'06 DAP'!D1096)","v":""}]
[null,null,null,{"$f":"IF('06 DAP'!D1097=\"\",\"\",'06 DAP'!D1097)","v":""}]
[null,null,null,{"$f":"IF('06 DAP'!D1098=\"\",\"\",'06 DAP'!D1098)","v":""}]
[null,null,null,{"$f":"IF('06 DAP'!D1099=\"\",\"\",'06 DAP'!D1099)","v":""}]
[null,null,null,{"$f":"IF('06 DAP'!D1100=\"\",\"\",'06 DAP'!D1100)","v":""}]
[null,null,null,{"$f":"IF('06 DAP'!D1101=\"\",\"\",'06 DAP'!D1101)","v":""}]
[null,null,null,{"$f":"IF('06 DAP'!D1102=\"\",\"\",'06 DAP'!D1102)","v":""}]
[null,null,null,{"$f":"IF('06 DAP'!D1103=\"\",\"\",'06 DAP'!D1103)","v":""}]
[null,null,null,{"$f":"IF('06 DAP'!D1104=\"\",\"\",'06 DAP'!D1104)","v":""}]
[null,null,null,{"$f":"IF('06 DAP'!D1105=\"\",\"\",'06 DAP'!D1105)","v":""}]
[null,null,null,{"$f":"IF('06 DAP'!D1106=\"\",\"\",'06 DAP'!D1106)","v":""}]
[null,null,null,{"$f":"IF('06 DAP'!D1107=\"\",\"\",'06 DAP'!D1107)","v":""}]
[null,null,null,{"$f":"IF('06 DAP'!D1108=\"\",\"\",'06 DAP'!D1108)","v":""}]
[null,null,null,{"$f":"IF('06 DAP'!D1109=\"\",\"\",'06 DAP'!D1109)","v":""}]
[null,null,null,{"$f":"IF('06 DAP'!D1110=\"\",\"\",'06 DAP'!D1110)","v":""}]
[null,null,null,{"$f":"IF('06 DAP'!D1111=\"\",\"\",'06 DAP'!D1111)","v":""}]
[null,null,null,{"$f":"IF('06 DAP'!D1112=\"\",\"\",'06 DAP'!D1112)","v":""}]
[null,null,null,{"$f":"IF('06 DAP'!D1113=\"\",\"\",'06 DAP'!D1113)","v":""}]
[null,null,null,{"$f":"IF('06 DAP'!D1114=\"\",\"\",'06 DAP'!D1114)","v":""}]
[null,null,null,{"$f":"IF('06 DAP'!D1115=\"\",\"\",'06 DAP'!D1115)","v":""}]
[null,null,null,{"$f":"IF('06 DAP'!D1116=\"\",\"\",'06 DAP'!D1116)","v":""}]
[null,null,null,{"$f":"IF('06 DAP'!D1117=\"\",\"\",'06 DAP'!D1117)","v":""}]
[null,null,null,{"$f":"IF('06 DAP'!D1118=\"\",\"\",'06 DAP'!D1118)","v":""}]
[null,null,null,{"$f":"IF('06 DAP'!D1119=\"\",\"\",'06 DAP'!D1119)","v":""}]
[null,null,null,{"$f":"IF('06 DAP'!D1120=\"\",\"\",'06 DAP'!D1120)","v":""}]
[null,null,null,{"$f":"IF('06 DAP'!D1121=\"\",\"\",'06 DAP'!D1121)","v":""}]
[null,null,null,{"$f":"IF('06 DAP'!D1122=\"\",\"\",'06 DAP'!D1122)","v":""}]
[null,null,null,{"$f":"IF('06 DAP'!D1123=\"\",\"\",'06 DAP'!D1123)","v":""}]
[null,null,null,{"$f":"IF('06 DAP'!D1124=\"\",\"\",'06 DAP'!D1124)","v":""}]
[null,null,null,{"$f":"IF('06 DAP'!D1125=\"\",\"\",'06 DAP'!D1125)","v":""}]
[null,null,null,{"$f":"IF('06 DAP'!D1126=\"\",\"\",'06 DAP'!D1126)","v":""}]
[null,null,null,{"$f":"IF('06 DAP'!D1127=\"\",\"\",'06 DAP'!D1127)","v":""}]
[null,null,null,{"$f":"IF('06 DAP'!D1128=\"\",\"\",'06 DAP'!D1128)","v":""}]
[null,null,null,{"$f":"IF('06 DAP'!D1129=\"\",\"\",'06 DAP'!D1129)","v":""}]
[null,null,null,{"$f":"IF('06 DAP'!D1130=\"\",\"\",'06 DAP'!D1130)","v":""}]
[null,null,null,{"$f":"IF('06 DAP'!D1131=\"\",\"\",'06 DAP'!D1131)","v":""}]
[null,null,null,{"$f":"IF('06 DAP'!D1132=\"\",\"\",'06 DAP'!D1132)","v":""}]
[null,null,null,{"$f":"IF('06 DAP'!D1133=\"\",\"\",'06 DAP'!D1133)","v":""}]
[null,null,null,{"$f":"IF('06 DAP'!D1134=\"\",\"\",'06 DAP'!D1134)","v":""}]
[null,null,null,{"$f":"IF('06 DAP'!D1135=\"\",\"\",'06 DAP'!D1135)","v":""}]
[null,null,null,{"$f":"IF('06 DAP'!D1136=\"\",\"\",'06 DAP'!D1136)","v":""}]
[null,null,null,{"$f":"IF('06 DAP'!D1137=\"\",\"\",'06 DAP'!D1137)","v":""}]
[null,null,null,{"$f":"IF('06 DAP'!D1138=\"\",\"\",'06 DAP'!D1138)","v":""}]
[null,null,null,{"$f":"IF('06 DAP'!D1139=\"\",\"\",'06 DAP'!D1139)","v":""}]
[null,null,null,{"$f":"IF('06 DAP'!D1140=\"\",\"\",'06 DAP'!D1140)","v":""}]
[null,null,null,{"$f":"IF('06 DAP'!D1141=\"\",\"\",'06 DAP'!D1141)","v":""}]
[null,null,null,{"$f":"IF('06 DAP'!D1142=\"\",\"\",'06 DAP'!D1142)","v":""}]
[null,null,null,{"$f":"IF('06 DAP'!D1143=\"\",\"\",'06 DAP'!D1143)","v":""}]
[null,null,null,{"$f":"IF('06 DAP'!D1144=\"\",\"\",'06 DAP'!D1144)","v":""}]
[null,null,null,{"$f":"IF('06 DAP'!D1145=\"\",\"\",'06 DAP'!D1145)","v":""}]
[null,null,null,{"$f":"IF('06 DAP'!D1146=\"\",\"\",'06 DAP'!D1146)","v":""}]
[null,null,null,{"$f":"IF('06 DAP'!D1147=\"\",\"\",'06 DAP'!D1147)","v":""}]
[null,null,null,{"$f":"IF('06 DAP'!D1148=\"\",\"\",'06 DAP'!D1148)","v":""}]
[null,null,null,{"$f":"IF('06 DAP'!D1149=\"\",\"\",'06 DAP'!D1149)","v":""}]
[null,null,null,{"$f":"IF('06 DAP'!D1150=\"\",\"\",'06 DAP'!D1150)","v":""}]
[null,null,null,{"$f":"IF('06 DAP'!D1151=\"\",\"\",'06 DAP'!D1151)","v":""}]
[null,null,null,{"$f":"IF('06 DAP'!D1152=\"\",\"\",'06 DAP'!D1152)","v":""}]
[null,null,null,{"$f":"IF('06 DAP'!D1153=\"\",\"\",'06 DAP'!D1153)","v":""}]
[null,null,null,{"$f":"IF('06 DAP'!D1154=\"\",\"\",'06 DAP'!D1154)","v":""}]
[null,null,null,{"$f":"IF('06 DAP'!D1155=\"\",\"\",'06 DAP'!D1155)","v":""}]
[null,null,null,{"$f":"IF('06 DAP'!D1156=\"\",\"\",'06 DAP'!D1156)","v":""}]
[null,null,null,{"$f":"IF('06 DAP'!D1157=\"\",\"\",'06 DAP'!D1157)","v":""}]
[null,null,null,{"$f":"IF('06 DAP'!D1158=\"\",\"\",'06 DAP'!D1158)","v":""}]
[null,null,null,{"$f":"IF('06 DAP'!D1159=\"\",\"\",'06 DAP'!D1159)","v":""}]
[null,null,null,{"$f":"IF('06 DAP'!D1160=\"\",\"\",'06 DAP'!D1160)","v":""}]
[null,null,null,{"$f":"IF('06 DAP'!D1161=\"\",\"\",'06 DAP'!D1161)","v":""}]
[null,null,null,{"$f":"IF('06 DAP'!D1162=\"\",\"\",'06 DAP'!D1162)","v":""}]
[null,null,null,{"$f":"IF('06 DAP'!D1163=\"\",\"\",'06 DAP'!D1163)","v":""}]
[null,null,null,{"$f":"IF('06 DAP'!D1164=\"\",\"\",'06 DAP'!D1164)","v":""}]
[null,null,null,{"$f":"IF('06 DAP'!D1165=\"\",\"\",'06 DAP'!D1165)","v":""}]
[null,null,null,{"$f":"IF('06 DAP'!D1166=\"\",\"\",'06 DAP'!D1166)","v":""}]
[null,null,null,{"$f":"IF('06 DAP'!D1167=\"\",\"\",'06 DAP'!D1167)","v":""}]
[null,null,null,{"$f":"IF('06 DAP'!D1168=\"\",\"\",'06 DAP'!D1168)","v":""}]
[null,null,null,{"$f":"IF('06 DAP'!D1169=\"\",\"\",'06 DAP'!D1169)","v":""}]
[null,null,null,{"$f":"IF('06 DAP'!D1170=\"\",\"\",'06 DAP'!D1170)","v":""}]
[null,null,null,{"$f":"IF('06 DAP'!D1171=\"\",\"\",'06 DAP'!D1171)","v":""}]
[null,null,null,{"$f":"IF('06 DAP'!D1172=\"\",\"\",'06 DAP'!D1172)","v":""}]
[null,null,null,{"$f":"IF('06 DAP'!D1173=\"\",\"\",'06 DAP'!D1173)","v":""}]
[null,null,null,{"$f":"IF('06 DAP'!D1174=\"\",\"\",'06 DAP'!D1174)","v":""}]
[null,null,null,{"$f":"IF('06 DAP'!D1175=\"\",\"\",'06 DAP'!D1175)","v":""}]
[null,null,null,{"$f":"IF('06 DAP'!D1176=\"\",\"\",'06 DAP'!D1176)","v":""}]
[null,null,null,{"$f":"IF('06 DAP'!D1177=\"\",\"\",'06 DAP'!D1177)","v":""}]
[null,null,null,{"$f":"IF('06 DAP'!D1178=\"\",\"\",'06 DAP'!D1178)","v":""}]
[null,null,null,{"$f":"IF('06 DAP'!D1179=\"\",\"\",'06 DAP'!D1179)","v":""}]
[null,null,null,{"$f":"IF('06 DAP'!D1180=\"\",\"\",'06 DAP'!D1180)","v":""}]
[null,null,null,{"$f":"IF('06 DAP'!D1181=\"\",\"\",'06 DAP'!D1181)","v":""}]
[null,null,null,{"$f":"IF('06 DAP'!D1182=\"\",\"\",'06 DAP'!D1182)","v":""}]
[null,null,null,{"$f":"IF('06 DAP'!D1183=\"\",\"\",'06 DAP'!D1183)","v":""}]
[null,null,null,{"$f":"IF('06 DAP'!D1184=\"\",\"\",'06 DAP'!D1184)","v":""}]
[null,null,null,{"$f":"IF('06 DAP'!D1185=\"\",\"\",'06 DAP'!D1185)","v":""}]
[null,null,null,{"$f":"IF('06 DAP'!D1186=\"\",\"\",'06 DAP'!D1186)","v":""}]
[null,null,null,{"$f":"IF('06 DAP'!D1187=\"\",\"\",'06 DAP'!D1187)","v":""}]
[null,null,null,{"$f":"IF('06 DAP'!D1188=\"\",\"\",'06 DAP'!D1188)","v":""}]
[null,null,null,{"$f":"IF('06 DAP'!D1189=\"\",\"\",'06 DAP'!D1189)","v":""}]
[null,null,null,{"$f":"IF('06 DAP'!D1190=\"\",\"\",'06 DAP'!D1190)","v":""}]
[null,null,null,{"$f":"IF('06 DAP'!D1191=\"\",\"\",'06 DAP'!D1191)","v":""}]
[null,null,null,{"$f":"IF('06 DAP'!D1192=\"\",\"\",'06 DAP'!D1192)","v":""}]
[null,null,null,{"$f":"IF('06 DAP'!D1193=\"\",\"\",'06 DAP'!D1193)","v":""}]
[null,null,null,{"$f":"IF('06 DAP'!D1194=\"\",\"\",'06 DAP'!D1194)","v":""}]
[null,null,null,{"$f":"IF('06 DAP'!D1195=\"\",\"\",'06 DAP'!D1195)","v":""}]
[null,null,null,{"$f":"IF('06 DAP'!D1196=\"\",\"\",'06 DAP'!D1196)","v":""}]
[null,null,null,{"$f":"IF('06 DAP'!D1197=\"\",\"\",'06 DAP'!D1197)","v":""}]
[null,null,null,{"$f":"IF('06 DAP'!D1198=\"\",\"\",'06 DAP'!D1198)","v":""}]
[null,null,null,{"$f":"IF('06 DAP'!D1199=\"\",\"\",'06 DAP'!D1199)","v":""}]
[null,null,null,{"$f":"IF('06 DAP'!D1200=\"\",\"\",'06 DAP'!D1200)","v":""}]
[null,null,null,{"$f":"IF('06 DAP'!D1201=\"\",\"\",'06 DAP'!D1201)","v":""}]
[null,null,null,{"$f":"IF('06 DAP'!D1202=\"\",\"\",'06 DAP'!D1202)","v":""}]
[null,null,null,{"$f":"IF('06 DAP'!D1203=\"\",\"\",'06 DAP'!D1203)","v":""}]
[null,null,null,{"$f":"IF('06 DAP'!D1204=\"\",\"\",'06 DAP'!D1204)","v":""}]
[null,null,null,{"$f":"IF('06 DAP'!D1205=\"\",\"\",'06 DAP'!D1205)","v":""}]
[null,null,null,{"$f":"IF('06 DAP'!D1206=\"\",\"\",'06 DAP'!D1206)","v":""}]
[null,null,null,{"$f":"IF('06 DAP'!D1207=\"\",\"\",'06 DAP'!D1207)","v":""}]
[null,null,null,{"$f":"IF('06 DAP'!D1208=\"\",\"\",'06 DAP'!D1208)","v":""}]
[null,null,null,{"$f":"IF('06 DAP'!D1209=\"\",\"\",'06 DAP'!D1209)","v":""}]
[null,null,null,{"$f":"IF('06 DAP'!D1210=\"\",\"\",'06 DAP'!D1210)","v":""}]
[null,null,null,{"$f":"IF('06 DAP'!D1211=\"\",\"\",'06 DAP'!D1211)","v":""}]
[null,null,null,{"$f":"IF('06 DAP'!D1212=\"\",\"\",'06 DAP'!D1212)","v":""}]
[null,null,null,{"$f":"IF('06 DAP'!D1213=\"\",\"\",'06 DAP'!D1213)","v":""}]
[null,null,null,{"$f":"IF('06 DAP'!D1214=\"\",\"\",'06 DAP'!D1214)","v":""}]
[null,null,null,{"$f":"IF('06 DAP'!D1215=\"\",\"\",'06 DAP'!D1215)","v":""}]
[null,null,null,{"$f":"IF('06 DAP'!D1216=\"\",\"\",'06 DAP'!D1216)","v":""}]
[null,null,null,{"$f":"IF('06 DAP'!D1217=\"\",\"\",'06 DAP'!D1217)","v":""}]
[null,null,null,{"$f":"IF('06 DAP'!D1218=\"\",\"\",'06 DAP'!D1218)","v":""}]
[null,null,null,{"$f":"IF('06 DAP'!D1219=\"\",\"\",'06 DAP'!D1219)","v":""}]
[null,null,null,{"$f":"IF('06 DAP'!D1220=\"\",\"\",'06 DAP'!D1220)","v":""}]
[null,null,null,{"$f":"IF('06 DAP'!D1221=\"\",\"\",'06 DAP'!D1221)","v":""}]
[null,null,null,{"$f":"IF('06 DAP'!D1222=\"\",\"\",'06 DAP'!D1222)","v":""}]
[null,null,null,{"$f":"IF('06 DAP'!D1223=\"\",\"\",'06 DAP'!D1223)","v":""}]
[null,null,null,{"$f":"IF('06 DAP'!D1224=\"\",\"\",'06 DAP'!D1224)","v":""}]
[null,null,null,{"$f":"IF('06 DAP'!D1225=\"\",\"\",'06 DAP'!D1225)","v":""}]
[null,null,null,{"$f":"IF('06 DAP'!D1226=\"\",\"\",'06 DAP'!D1226)","v":""}]
[null,null,null,{"$f":"IF('06 DAP'!D1227=\"\",\"\",'06 DAP'!D1227)","v":""}]
[null,null,null,{"$f":"IF('06 DAP'!D1228=\"\",\"\",'06 DAP'!D1228)","v":""}]
[null,null,null,{"$f":"IF('06 DAP'!D1229=\"\",\"\",'06 DAP'!D1229)","v":""}]
[null,null,null,{"$f":"IF('06 DAP'!D1230=\"\",\"\",'06 DAP'!D1230)","v":""}]
[null,null,null,{"$f":"IF('06 DAP'!D1231=\"\",\"\",'06 DAP'!D1231)","v":""}]
[null,null,null,{"$f":"IF('06 DAP'!D1232=\"\",\"\",'06 DAP'!D1232)","v":""}]
[null,null,null,{"$f":"IF('06 DAP'!D1233=\"\",\"\",'06 DAP'!D1233)","v":""}]
[null,null,null,{"$f":"IF('06 DAP'!D1234=\"\",\"\",'06 DAP'!D1234)","v":""}]
[null,null,null,{"$f":"IF('06 DAP'!D1235=\"\",\"\",'06 DAP'!D1235)","v":""}]
[null,null,null,{"$f":"IF('06 DAP'!D1236=\"\",\"\",'06 DAP'!D1236)","v":""}]
[null,null,null,{"$f":"IF('06 DAP'!D1237=\"\",\"\",'06 DAP'!D1237)","v":""}]
[null,null,null,{"$f":"IF('06 DAP'!D1238=\"\",\"\",'06 DAP'!D1238)","v":""}]
[null,null,null,{"$f":"IF('06 DAP'!D1239=\"\",\"\",'06 DAP'!D1239)","v":""}]
[null,null,null,{"$f":"IF('06 DAP'!D1240=\"\",\"\",'06 DAP'!D1240)","v":""}]
[null,null,null,{"$f":"IF('06 DAP'!D1241=\"\",\"\",'06 DAP'!D1241)","v":""}]
[null,null,null,{"$f":"IF('06 DAP'!D1242=\"\",\"\",'06 DAP'!D1242)","v":""}]
[null,null,null,{"$f":"IF('06 DAP'!D1243=\"\",\"\",'06 DAP'!D1243)","v":""}]
[null,null,null,{"$f":"IF('06 DAP'!D1244=\"\",\"\",'06 DAP'!D1244)","v":""}]
[null,null,null,{"$f":"IF('06 DAP'!D1245=\"\",\"\",'06 DAP'!D1245)","v":""}]
[null,null,null,{"$f":"IF('06 DAP'!D1246=\"\",\"\",'06 DAP'!D1246)","v":""}]
[null,null,null,{"$f":"IF('06 DAP'!D1247=\"\",\"\",'06 DAP'!D1247)","v":""}]
[null,null,null,{"$f":"IF('06 DAP'!D1248=\"\",\"\",'06 DAP'!D1248)","v":""}]
[null,null,null,{"$f":"IF('06 DAP'!D1249=\"\",\"\",'06 DAP'!D1249)","v":""}]
[null,null,null,{"$f":"IF('06 DAP'!D1250=\"\",\"\",'06 DAP'!D1250)","v":""}]
[null,null,null,{"$f":"IF('06 DAP'!D1251=\"\",\"\",'06 DAP'!D1251)","v":""}]
[null,null,null,{"$f":"IF('06 DAP'!D1252=\"\",\"\",'06 DAP'!D1252)","v":""}]
[null,null,null,{"$f":"IF('06 DAP'!D1253=\"\",\"\",'06 DAP'!D1253)","v":""}]
[null,null,null,{"$f":"IF('06 DAP'!D1254=\"\",\"\",'06 DAP'!D1254)","v":""}]
[null,null,null,{"$f":"IF('06 DAP'!D1255=\"\",\"\",'06 DAP'!D1255)","v":""}]
[null,null,null,{"$f":"IF('06 DAP'!D1256=\"\",\"\",'06 DAP'!D1256)","v":""}]
[null,null,null,{"$f":"IF('06 DAP'!D1257=\"\",\"\",'06 DAP'!D1257)","v":""}]
[null,null,null,{"$f":"IF('06 DAP'!D1258=\"\",\"\",'06 DAP'!D1258)","v":""}]
[null,null,null,{"$f":"IF('06 DAP'!D1259=\"\",\"\",'06 DAP'!D1259)","v":""}]
[null,null,null,{"$f":"IF('06 DAP'!D1260=\"\",\"\",'06 DAP'!D1260)","v":""}]
[null,null,null,{"$f":"IF('06 DAP'!D1261=\"\",\"\",'06 DAP'!D1261)","v":""}]
[null,null,null,{"$f":"IF('06 DAP'!D1262=\"\",\"\",'06 DAP'!D1262)","v":""}]
[null,null,null,{"$f":"IF('06 DAP'!D1263=\"\",\"\",'06 DAP'!D1263)","v":""}]
[null,null,null,{"$f":"IF('06 DAP'!D1264=\"\",\"\",'06 DAP'!D1264)","v":""}]
[null,null,null,{"$f":"IF('06 DAP'!D1265=\"\",\"\",'06 DAP'!D1265)","v":""}]
[null,null,null,{"$f":"IF('06 DAP'!D1266=\"\",\"\",'06 DAP'!D1266)","v":""}]
[null,null,null,{"$f":"IF('06 DAP'!D1267=\"\",\"\",'06 DAP'!D1267)","v":""}]
[null,null,null,{"$f":"IF('06 DAP'!D1268=\"\",\"\",'06 DAP'!D1268)","v":""}]
[null,null,null,{"$f":"IF('06 DAP'!D1269=\"\",\"\",'06 DAP'!D1269)","v":""}]
[null,null,null,{"$f":"IF('06 DAP'!D1270=\"\",\"\",'06 DAP'!D1270)","v":""}]
[null,null,null,{"$f":"IF('06 DAP'!D1271=\"\",\"\",'06 DAP'!D1271)","v":""}]
[null,null,null,{"$f":"IF('06 DAP'!D1272=\"\",\"\",'06 DAP'!D1272)","v":""}]
[null,null,null,{"$f":"IF('06 DAP'!D1273=\"\",\"\",'06 DAP'!D1273)","v":""}]
[null,null,null,{"$f":"IF('06 DAP'!D1274=\"\",\"\",'06 DAP'!D1274)","v":""}]
[null,null,null,{"$f":"IF('06 DAP'!D1275=\"\",\"\",'06 DAP'!D1275)","v":""}]
[null,null,null,{"$f":"IF('06 DAP'!D1276=\"\",\"\",'06 DAP'!D1276)","v":""}]
[null,null,null,{"$f":"IF('06 DAP'!D1277=\"\",\"\",'06 DAP'!D1277)","v":""}]
[null,null,null,{"$f":"IF('06 DAP'!D1278=\"\",\"\",'06 DAP'!D1278)","v":""}]
[null,null,null,{"$f":"IF('06 DAP'!D1279=\"\",\"\",'06 DAP'!D1279)","v":""}]
[null,null,null,{"$f":"IF('06 DAP'!D1280=\"\",\"\",'06 DAP'!D1280)","v":""}]
[null,null,null,{"$f":"IF('06 DAP'!D1281=\"\",\"\",'06 DAP'!D1281)","v":""}]
[null,null,null,{"$f":"IF('06 DAP'!D1282=\"\",\"\",'06 DAP'!D1282)","v":""}]
[null,null,null,{"$f":"IF('06 DAP'!D1283=\"\",\"\",'06 DAP'!D1283)","v":""}]
[null,null,null,{"$f":"IF('06 DAP'!D1284=\"\",\"\",'06 DAP'!D1284)","v":""}]
[null,null,null,{"$f":"IF('06 DAP'!D1285=\"\",\"\",'06 DAP'!D1285)","v":""}]
[null,null,null,{"$f":"IF('06 DAP'!D1286=\"\",\"\",'06 DAP'!D1286)","v":""}]
[null,null,null,{"$f":"IF('06 DAP'!D1287=\"\",\"\",'06 DAP'!D1287)","v":""}]
[null,null,null,{"$f":"IF('06 DAP'!D1288=\"\",\"\",'06 DAP'!D1288)","v":""}]
[null,null,null,{"$f":"IF('06 DAP'!D1289=\"\",\"\",'06 DAP'!D1289)","v":""}]
[null,null,null,{"$f":"IF('06 DAP'!D1290=\"\",\"\",'06 DAP'!D1290)","v":""}]
[null,null,null,{"$f":"IF('06 DAP'!D1291=\"\",\"\",'06 DAP'!D1291)","v":""}]
[null,null,null,{"$f":"IF('06 DAP'!D1292=\"\",\"\",'06 DAP'!D1292)","v":""}]
[null,null,null,{"$f":"IF('06 DAP'!D1293=\"\",\"\",'06 DAP'!D1293)","v":""}]
[null,null,null,{"$f":"IF('06 DAP'!D1294=\"\",\"\",'06 DAP'!D1294)","v":""}]
[null,null,null,{"$f":"IF('06 DAP'!D1295=\"\",\"\",'06 DAP'!D1295)","v":""}]
[null,null,null,{"$f":"IF('06 DAP'!D1296=\"\",\"\",'06 DAP'!D1296)","v":""}]
[null,null,null,{"$f":"IF('06 DAP'!D1297=\"\",\"\",'06 DAP'!D1297)","v":""}]
[null,null,null,{"$f":"IF('06 DAP'!D1298=\"\",\"\",'06 DAP'!D1298)","v":""}]
[null,null,null,{"$f":"IF('06 DAP'!D1299=\"\",\"\",'06 DAP'!D1299)","v":""}]
[null,null,null,{"$f":"IF('06 DAP'!D1300=\"\",\"\",'06 DAP'!D1300)","v":""}]
[null,null,null,{"$f":"IF('06 DAP'!D1301=\"\",\"\",'06 DAP'!D1301)","v":""}]
[null,null,null,{"$f":"IF('06 DAP'!D1302=\"\",\"\",'06 DAP'!D1302)","v":""}]
[null,null,null,{"$f":"IF('06 DAP'!D1303=\"\",\"\",'06 DAP'!D1303)","v":""}]
[null,null,null,{"$f":"IF('06 DAP'!D1304=\"\",\"\",'06 DAP'!D1304)","v":""}]
[null,null,null,{"$f":"IF('06 DAP'!D1305=\"\",\"\",'06 DAP'!D1305)","v":""}]
[null,null,null,{"$f":"IF('06 DAP'!D1306=\"\",\"\",'06 DAP'!D1306)","v":""}]
[null,null,null,{"$f":"IF('06 DAP'!D1307=\"\",\"\",'06 DAP'!D1307)","v":""}]
[null,null,null,{"$f":"IF('06 DAP'!D1308=\"\",\"\",'06 DAP'!D1308)","v":""}]
[null,null,null,{"$f":"IF('06 DAP'!D1309=\"\",\"\",'06 DAP'!D1309)","v":""}]
[null,null,null,{"$f":"IF('06 DAP'!D1310=\"\",\"\",'06 DAP'!D1310)","v":""}]
[null,null,null,{"$f":"IF('06 DAP'!D1311=\"\",\"\",'06 DAP'!D1311)","v":""}]
[null,null,null,{"$f":"IF('06 DAP'!D1312=\"\",\"\",'06 DAP'!D1312)","v":""}]
[null,null,null,{"$f":"IF('06 DAP'!D1313=\"\",\"\",'06 DAP'!D1313)","v":""}]
[null,null,null,{"$f":"IF('06 DAP'!D1314=\"\",\"\",'06 DAP'!D1314)","v":""}]
[null,null,null,{"$f":"IF('06 DAP'!D1315=\"\",\"\",'06 DAP'!D1315)","v":""}]
[null,null,null,{"$f":"IF('06 DAP'!D1316=\"\",\"\",'06 DAP'!D1316)","v":""}]
[null,null,null,{"$f":"IF('06 DAP'!D1317=\"\",\"\",'06 DAP'!D1317)","v":""}]
[null,null,null,{"$f":"IF('06 DAP'!D1318=\"\",\"\",'06 DAP'!D1318)","v":""}]
[null,null,null,{"$f":"IF('06 DAP'!D1319=\"\",\"\",'06 DAP'!D1319)","v":""}]
[null,null,null,{"$f":"IF('06 DAP'!D1320=\"\",\"\",'06 DAP'!D1320)","v":""}]
[null,null,null,{"$f":"IF('06 DAP'!D1321=\"\",\"\",'06 DAP'!D1321)","v":""}]
[null,null,null,{"$f":"IF('06 DAP'!D1322=\"\",\"\",'06 DAP'!D1322)","v":""}]
[null,null,null,{"$f":"IF('06 DAP'!D1323=\"\",\"\",'06 DAP'!D1323)","v":""}]
[null,null,null,{"$f":"IF('06 DAP'!D1324=\"\",\"\",'06 DAP'!D1324)","v":""}]
[null,null,null,{"$f":"IF('06 DAP'!D1325=\"\",\"\",'06 DAP'!D1325)","v":""}]
[null,null,null,{"$f":"IF('06 DAP'!D1326=\"\",\"\",'06 DAP'!D1326)","v":""}]
[null,null,null,{"$f":"IF('06 DAP'!D1327=\"\",\"\",'06 DAP'!D1327)","v":""}]
[null,null,null,{"$f":"IF('06 DAP'!D1328=\"\",\"\",'06 DAP'!D1328)","v":""}]
[null,null,null,{"$f":"IF('06 DAP'!D1329=\"\",\"\",'06 DAP'!D1329)","v":""}]
[null,null,null,{"$f":"IF('06 DAP'!D1330=\"\",\"\",'06 DAP'!D1330)","v":""}]
[null,null,null,{"$f":"IF('06 DAP'!D1331=\"\",\"\",'06 DAP'!D1331)","v":""}]
[null,null,null,{"$f":"IF('06 DAP'!D1332=\"\",\"\",'06 DAP'!D1332)","v":""}]
[null,null,null,{"$f":"IF('06 DAP'!D1333=\"\",\"\",'06 DAP'!D1333)","v":""}]
[null,null,null,{"$f":"IF('06 DAP'!D1334=\"\",\"\",'06 DAP'!D1334)","v":""}]
[null,null,null,{"$f":"IF('06 DAP'!D1335=\"\",\"\",'06 DAP'!D1335)","v":""}]
[null,null,null,{"$f":"IF('06 DAP'!D1336=\"\",\"\",'06 DAP'!D1336)","v":""}]
[null,null,null,{"$f":"IF('06 DAP'!D1337=\"\",\"\",'06 DAP'!D1337)","v":""}]
[null,null,null,{"$f":"IF('06 DAP'!D1338=\"\",\"\",'06 DAP'!D1338)","v":""}]
[null,null,null,{"$f":"IF('06 DAP'!D1339=\"\",\"\",'06 DAP'!D1339)","v":""}]
[null,null,null,{"$f":"IF('06 DAP'!D1340=\"\",\"\",'06 DAP'!D1340)","v":""}]
[null,null,null,{"$f":"IF('06 DAP'!D1341=\"\",\"\",'06 DAP'!D1341)","v":""}]
[null,null,null,{"$f":"IF('06 DAP'!D1342=\"\",\"\",'06 DAP'!D1342)","v":""}]
[null,null,null,{"$f":"IF('06 DAP'!D1343=\"\",\"\",'06 DAP'!D1343)","v":""}]
[null,null,null,{"$f":"IF('06 DAP'!D1344=\"\",\"\",'06 DAP'!D1344)","v":""}]
[null,null,null,{"$f":"IF('06 DAP'!D1345=\"\",\"\",'06 DAP'!D1345)","v":""}]
[null,null,null,{"$f":"IF('06 DAP'!D1346=\"\",\"\",'06 DAP'!D1346)","v":""}]
[null,null,null,{"$f":"IF('06 DAP'!D1347=\"\",\"\",'06 DAP'!D1347)","v":""}]
[null,null,null,{"$f":"IF('06 DAP'!D1348=\"\",\"\",'06 DAP'!D1348)","v":""}]
[null,null,null,{"$f":"IF('06 DAP'!D1349=\"\",\"\",'06 DAP'!D1349)","v":""}]
[null,null,null,{"$f":"IF('06 DAP'!D1350=\"\",\"\",'06 DAP'!D1350)","v":""}]
[null,null,null,{"$f":"IF('06 DAP'!D1351=\"\",\"\",'06 DAP'!D1351)","v":""}]
[null,null,null,{"$f":"IF('06 DAP'!D1352=\"\",\"\",'06 DAP'!D1352)","v":""}]
[null,null,null,{"$f":"IF('06 DAP'!D1353=\"\",\"\",'06 DAP'!D1353)","v":""}]
[null,null,null,{"$f":"IF('06 DAP'!D1354=\"\",\"\",'06 DAP'!D1354)","v":""}]
[null,null,null,{"$f":"IF('06 DAP'!D1355=\"\",\"\",'06 DAP'!D1355)","v":""}]
[null,null,null,{"$f":"IF('06 DAP'!D1356=\"\",\"\",'06 DAP'!D1356)","v":""}]
[null,null,null,{"$f":"IF('06 DAP'!D1357=\"\",\"\",'06 DAP'!D1357)","v":""}]
[null,null,null,{"$f":"IF('06 DAP'!D1358=\"\",\"\",'06 DAP'!D1358)","v":""}]
[null,null,null,{"$f":"IF('06 DAP'!D1359=\"\",\"\",'06 DAP'!D1359)","v":""}]
[null,null,null,{"$f":"IF('06 DAP'!D1360=\"\",\"\",'06 DAP'!D1360)","v":""}]
[null,null,null,{"$f":"IF('06 DAP'!D1361=\"\",\"\",'06 DAP'!D1361)","v":""}]
[null,null,null,{"$f":"IF('06 DAP'!D1362=\"\",\"\",'06 DAP'!D1362)","v":""}]
[null,null,null,{"$f":"IF('06 DAP'!D1363=\"\",\"\",'06 DAP'!D1363)","v":""}]
[null,null,null,{"$f":"IF('06 DAP'!D1364=\"\",\"\",'06 DAP'!D1364)","v":""}]
[null,null,null,{"$f":"IF('06 DAP'!D1365=\"\",\"\",'06 DAP'!D1365)","v":""}]
[null,null,null,{"$f":"IF('06 DAP'!D1366=\"\",\"\",'06 DAP'!D1366)","v":""}]
[null,null,null,{"$f":"IF('06 DAP'!D1367=\"\",\"\",'06 DAP'!D1367)","v":""}]
[null,null,null,{"$f":"IF('06 DAP'!D1368=\"\",\"\",'06 DAP'!D1368)","v":""}]
[null,null,null,{"$f":"IF('06 DAP'!D1369=\"\",\"\",'06 DAP'!D1369)","v":""}]
[null,null,null,{"$f":"IF('06 DAP'!D1370=\"\",\"\",'06 DAP'!D1370)","v":""}]
[null,null,null,{"$f":"IF('06 DAP'!D1371=\"\",\"\",'06 DAP'!D1371)","v":""}]
[null,null,null,{"$f":"IF('06 DAP'!D1372=\"\",\"\",'06 DAP'!D1372)","v":""}]
[null,null,null,{"$f":"IF('06 DAP'!D1373=\"\",\"\",'06 DAP'!D1373)","v":""}]
[null,null,null,{"$f":"IF('06 DAP'!D1374=\"\",\"\",'06 DAP'!D1374)","v":""}]
[null,null,null,{"$f":"IF('06 DAP'!D1375=\"\",\"\",'06 DAP'!D1375)","v":""}]
[null,null,null,{"$f":"IF('06 DAP'!D1376=\"\",\"\",'06 DAP'!D1376)","v":""}]
[null,null,null,{"$f":"IF('06 DAP'!D1377=\"\",\"\",'06 DAP'!D1377)","v":""}]
[null,null,null,{"$f":"IF('06 DAP'!D1378=\"\",\"\",'06 DAP'!D1378)","v":""}]
[null,null,null,{"$f":"IF('06 DAP'!D1379=\"\",\"\",'06 DAP'!D1379)","v":""}]
[null,null,null,{"$f":"IF('06 DAP'!D1380=\"\",\"\",'06 DAP'!D1380)","v":""}]
[null,null,null,{"$f":"IF('06 DAP'!D1381=\"\",\"\",'06 DAP'!D1381)","v":""}]
[null,null,null,{"$f":"IF('06 DAP'!D1382=\"\",\"\",'06 DAP'!D1382)","v":""}]
[null,null,null,{"$f":"IF('06 DAP'!D1383=\"\",\"\",'06 DAP'!D1383)","v":""}]
[null,null,null,{"$f":"IF('06 DAP'!D1384=\"\",\"\",'06 DAP'!D1384)","v":""}]
[null,null,null,{"$f":"IF('06 DAP'!D1385=\"\",\"\",'06 DAP'!D1385)","v":""}]
[null,null,null,{"$f":"IF('06 DAP'!D1386=\"\",\"\",'06 DAP'!D1386)","v":""}]
[null,null,null,{"$f":"IF('06 DAP'!D1387=\"\",\"\",'06 DAP'!D1387)","v":""}]
[null,null,null,{"$f":"IF('06 DAP'!D1388=\"\",\"\",'06 DAP'!D1388)","v":""}]
[null,null,null,{"$f":"IF('06 DAP'!D1389=\"\",\"\",'06 DAP'!D1389)","v":""}]
[null,null,null,{"$f":"IF('06 DAP'!D1390=\"\",\"\",'06 DAP'!D1390)","v":""}]
[null,null,null,{"$f":"IF('06 DAP'!D1391=\"\",\"\",'06 DAP'!D1391)","v":""}]
[null,null,null,{"$f":"IF('06 DAP'!D1392=\"\",\"\",'06 DAP'!D1392)","v":""}]
[null,null,null,{"$f":"IF('06 DAP'!D1393=\"\",\"\",'06 DAP'!D1393)","v":""}]
[null,null,null,{"$f":"IF('06 DAP'!D1394=\"\",\"\",'06 DAP'!D1394)","v":""}]
[null,null,null,{"$f":"IF('06 DAP'!D1395=\"\",\"\",'06 DAP'!D1395)","v":""}]
[null,null,null,{"$f":"IF('06 DAP'!D1396=\"\",\"\",'06 DAP'!D1396)","v":""}]
[null,null,null,{"$f":"IF('06 DAP'!D1397=\"\",\"\",'06 DAP'!D1397)","v":""}]
[null,null,null,{"$f":"IF('06 DAP'!D1398=\"\",\"\",'06 DAP'!D1398)","v":""}]
[null,null,null,{"$f":"IF('06 DAP'!D1399=\"\",\"\",'06 DAP'!D1399)","v":""}]
[null,null,null,{"$f":"IF('06 DAP'!D1400=\"\",\"\",'06 DAP'!D1400)","v":""}]
[null,null,null,{"$f":"IF('06 DAP'!D1401=\"\",\"\",'06 DAP'!D1401)","v":""}]

{"sheet":"Template Info","index":4,"n_rows":15,"n_cols":6,"rows_kept":15,"cut":false,"hidden":true,"merged":[[0,0,1,2],[2,2,2,3]]}
["TEMPLATE INFO"]
[]
[]
["NOTE:"]
["-  This is page is in regard to the maintenance of the whole spreadsheet"]
["-  This spreadsheet is only to be edited by those who understand the links and formulae in order to make any necessary modifications and enhancements"]
["-  This spreadsheet is password protected to prevent errors occurring and the breaking of formulae and links"]
["- Contact Jonathan Han if any bugs found - via LinkedIn - https://uk.linkedin.com/in/hanstar007"]
[]
[]
["REVISION NO.","DATE","REVISION BY","COMMENTS","REVIEWED BY","ISSUED BY"]
[1,"2016-11-05","Jonathan Han\nCEng MICE","CPD Tracker Separated from Main Spreadsheet","Peter Hallsworth\nCEng FICE MICE","Jonathan Han\nCEng MICE"]
[2,"2017-03-12","Jonathan Han\nCEng MICE","Updated to clear any bugs and include an example screenshot area","Peter Hallsworth\nCEng FICE MICE","Jonathan Han\nCEng MICE"]
[3]
[4]

{"sheet":"Holidays","index":5,"n_rows":129,"n_cols":3,"rows_kept":129,"cut":false,"hidden":true,"merged":[]}
["Holidays","Date","Year"]
["Near Year's Day","2015-01-01",2015]
["Good Friday","2015-04-03",2015]
["Easter Monday","2015-04-06",2015]
["Early May Bank Holiday","2015-05-04",2015]
["Spring Bank Holiday","2015-05-25",2015]
["Summer Bank Holiday","2015-05-31",2015]
["Christmas Day","2015-12-25",2015]
["Boxing Day","2015-12-26",2015]
["Near Year's Day","2016-01-01",2016]
["Good Friday","2016-03-25",2016]
["Easter Monday","2016-03-28",2016]
["Early May Bank Holiday","2016-05-02",2016]
["Spring Bank Holiday","2016-05-30",2016]
["Summer Bank Holiday","2016-08-29",2016]
["Christmas Day","2016-12-25",2016]
["Boxing Day","2016-12-26",2016]
["Near Year's Day","2017-01-01",2017]
["Good Friday","2017-04-14",2017]
["Easter Monday","2017-04-17",2017]
["Early May Bank Holiday","2017-05-01",2017]
["Spring Bank Holiday","2017-05-29",2017]
["Summer Bank Holiday","2017-08-28",2017]
["Christmas Day","2017-12-25",2017]
["Boxing Day","2017-12-26",2017]
["Near Year's Day","2018-01-01",2018]
["Good Friday","2018-03-30",2018]
["Easter Monday","2018-04-02",2018]
["Early May Bank Holiday","2018-05-07",2018]
["Spring Bank Holiday","2018-05-28",2018]
["Summer Bank Holiday","2018-08-27",2018]
["Christmas Day","2018-12-25",2018]
["Boxing Day","2018-12-26",2018]
["Near Year's Day","2019-01-01",2019]
["Good Friday","2019-04-19",2019]
["Easter Monday","2019-04-22",2019]
["Early May Bank Holiday","2019-05-06",2019]
["Spring Bank Holiday","2019-05-27",2019]
["Summer Bank Holiday","2019-08-26",2019]
["Christmas Day","2019-12-25",2019]
["Boxing Day","2019-12-26",2019]
["Near Year's Day","2020-01-01",2020]
["Good Friday","2020-04-10",2020]
["Easter Monday","2020-04-13",2020]
["Early May Bank Holiday","2020-05-04",2020]
["Spring Bank Holiday","2020-05-25",2020]
["Summer Bank Holiday","2020-08-31",2020]
["Christmas Day","2020-12-25",2020]
["Boxing Day","2020-12-26",2020]
["Near Year's Day","2021-01-01",2021]
["Good Friday","2021-04-02",2021]
["Easter Monday","2021-04-05",2021]
["Early May Bank Holiday","2021-05-03",2021]
["Spring Bank Holiday","2021-05-31",2021]
["Summer Bank Holiday","2021-08-30",2021]
["Christmas Day","2021-12-25",2021]
["Boxing Day","2021-12-26",2021]
["Near Year's Day","2022-01-01",2022]
["Good Friday","2022-04-15",2022]
["Easter Monday","2022-04-18",2022]
["Early May Bank Holiday","2022-05-02",2022]
["Spring Bank Holiday","2022-05-30",2022]
["Summer Bank Holiday","2022-08-29",2022]
["Christmas Day","2022-12-25",2022]
["Boxing Day","2022-12-26",2022]
["Near Year's Day","2023-01-01",2023]
["Good Friday","2023-04-07",2023]
["Easter Monday","2023-04-10",2023]
["Early May Bank Holiday","2023-05-01",2023]
["Spring Bank Holiday","2023-05-29",2023]
["Summer Bank Holiday","2023-08-28",2023]
["Christmas Day","2023-12-25",2023]
["Boxing Day","2023-12-26",2023]
["Near Year's Day","2024-01-01",2024]
["Good Friday","2024-03-29",2024]
["Easter Monday","2024-04-01",2024]
["Early May Bank Holiday","2024-05-06",2024]
["Spring Bank Holiday","2024-05-27",2024]
["Summer Bank Holiday","2024-08-26",2024]
["Christmas Day","2024-12-25",2024]
["Boxing Day","2024-12-26",2024]
["Near Year's Day","2025-01-01",2025]
["Good Friday","2025-04-18",2025]
["Easter Monday",{"$f":"B83+3","v":"2025-04-21"},2025]
["Early May Bank Holiday","2025-05-05",2025]
["Spring Bank Holiday","2025-05-26",2025]
["Summer Bank Holiday","2025-08-25",2025]
["Christmas Day","2025-12-25",2025]
["Boxing Day","2025-12-26",2025]
["Near Year's Day","2026-01-01",2026]
["Good Friday","2026-04-03",2026]
["Easter Monday",{"$f":"B91+3","v":"2026-04-06"},2026]
["Early May Bank Holiday","2026-05-04",2026]
["Spring Bank Holiday","2026-05-25",2026]
["Summer Bank Holiday","2026-08-31",2026]
["Christmas Day","2026-12-25",2026]
["Boxing Day","2026-12-26",2026]
["Near Year's Day","2027-01-01",2027]
["Good Friday","2027-03-26",2027]
["Easter Monday",{"$f":"B99+3","v":"2027-03-29"},2027]
["Early May Bank Holiday","2027-05-03",2027]
["Spring Bank Holiday","2027-05-31",2027]
["Summer Bank Holiday","2027-08-30",2027]
["Christmas Day","2027-12-25",2027]
["Boxing Day","2027-12-26",2027]
["Near Year's Day","2028-01-01",2028]
["Good Friday","2028-04-14",2028]
["Easter Monday",{"$f":"B107+3","v":"2028-04-17"},2028]
["Early May Bank Holiday","2028-05-01",2028]
["Spring Bank Holiday","2028-05-29",2028]
["Summer Bank Holiday","2028-08-28",2028]
["Christmas Day","2028-12-25",2028]
["Boxing Day","2028-12-26",2028]
["Near Year's Day","2029-01-01",2029]
["Good Friday","2029-03-30",2029]
["Easter Monday",{"$f":"B115+3","v":"2029-04-02"},2029]
["Early May Bank Holiday","2029-05-07",2029]
["Spring Bank Holiday","2029-05-28",2029]
["Summer Bank Holiday","2029-08-27",2029]
["Christmas Day","2029-12-25",2029]
["Boxing Day","2029-12-26",2029]
["Near Year's Day","2025-01-01",2030]
["Good Friday","2025-04-19",2030]
["Easter Monday",{"$f":"B123+3","v":"2025-04-22"},2030]
["Early May Bank Holiday","2025-05-06",2030]
["Spring Bank Holiday","2025-05-27",2030]
["Summer Bank Holiday","2025-08-26",2030]
["Christmas Day","2025-12-25",2030]
["Boxing Day","2025-12-26",2030]